International Council on Archives Records in Contexts Ontology (ICA RiC-O) version 1.1
type: Ontology
version IRI: https://www.ica.org/standards/RiC/ontology/1.1
license: https://creativecommons.org/licenses/by/4.0/
contributor: Florence Clavaud (Archives nationales de France), member of EGAD and lead of EGAD RiC-O team from 2012
contributor: Regine I. Heberlein (University of Princeton, USA), member of EGAD and EGAD RiC-O team from 2023 to 2024
contributor: Miia Herrala (National Archives of Finland), member of EGAD and EGAD RiC-O team from 2016 to 2022
contributor: Jan Krause-Bilvin (docuteam, Switzerland), member of EGAD and EGAD RiC-O team from 2023
contributor: Daniel Pitti (University of Virginia, USA), chair of EGAD from 2012
contributor: Aaron Rubinstein (University of Massachusetts Amherst, USA), member of EGAD and EGAD RiC-O team from 2012 to 2022
contributor: Tobias Wildi (docuteam, Switzerland), member of EGAD and EGAD RiC-O team from 2019
contributor: Richard David Williamson (National Archives of Norway), member of EGAD and of EGAD RiC-O team from 2024
contributor: Ivo Zandhuis (Consultant Digital Cultural Heritage, The Netherlands), member of EGAD and EGAD RiC-O team from 2023
creator: International Council on Archives Expert Group on Archival Description (ICA EGAD)
publisher: International Council on Archives
rights: Copyright 2019-, International Council on Archives (ICA)
abstract: RiC-O (Records in Contexts-Ontology) is an OWL ontology for describing archival record resources. As the third part of Records in Contexts standard, it is a formal representation of Records in Contexts Conceptual Model (RiC-CM). RiC-O provides a generic vocabulary and formal rules for creating RDF datasets to describe any kind of archival record resource, whether natively or by transforming existing metadata (or generating them from existing archival metadata). It supports publishing RDF datasets as Linked Data, querying them using SPARQL, and making inferences. The current version is v1.1; it is compliant with RiC-CM 1.0, which was published by EGAD on November 30, 2023.
contributor: https://orcid.org/0000-0001-6743-9622
contributor: https://orcid.org/0000-0001-9375-2102
contributor: https://orcid.org/0000-0001-9938-6502
contributor: https://orcid.org/0000-0002-0803-8025
contributor: https://orcid.org/0000-0002-5681-4850
contributor: https://orcid.org/0000-0003-0165-8341
contributor: https://orcid.org/0009-0004-3219-2534
description: Introduction RiC-O (Records in Contexts-Ontology) is an OWL ontology for describing archival record resources. As the third part of Records in Contexts standard, it is a formal representation of Records in Contexts Conceptual Model (RiC-CM). This version, which is v1.1, is the latest official release. It is compliant with RiC-CM v1.0. The following diagram shows the main RiC-CM 1.0 entities and a few relations between them: RiC-O design principles The following design principles were followed when developing RiC-O. 1. RiC-O is a domain and reference ontology. RiC-O provides a generic vocabulary and formal rules for creating RDF datasets (or generating them from existing archival metadata) that describe in a consistent way any kind of archival record resource. It supports publishing RDF datasets as Linked Data, querying them using SPARQL, and making inferences using the logic of the ontology. While some projects have built some specific ontologies for describing archives, in 2013 no generic domain ontology existed for the specific needs of the archival community. This is why EGAD decided to develop RiC-O as a part of RiC standard. Apart from this first, main target, RiC-O, as a technical implementation of RiC-CM that also extends and refines it and that includes formal logic, can guide or inspire, in many ways, the development of any tool or system that manages (i.e. stores, enables to edit or processes) and publishes descriptive archival metadata.. Of course, other technical implementations of RiC-CM may be developed later on. Also, the current technical implementations of the former ICA standards, e.g. EAD and EAC-CPF XML schemas, should be made closer to RiC-CM in the future; on this topic, see the news and announcements of the Technical Subcommittee on Encoded Archival Standards (TS-EAS) of the Society of American Archivists. As RiC-O is a generic, domain ontology, it does not address by itself every specific need or expectation that may occur in every archival i…
publisher: Q1421986
preferred namespace prefix: rico
preferred namespace uri: https://www.ica.org/standards/RiC/ontology#
incompatible with: RiC-O v0-2.rdf
prior version: RiC-O v0-2.rdf
prior version: RiC-O 1-0-beta.rdf
prior version: RiC-O 1-0.rdf
prior version: RiC-O 1-0-1.rdf
prior version: https://www.ica.org/standards/RiC/ontology/1.0.2
version info: Version 1.1 - 2025-05-22.
history note: History note A first beta version of RiC-O was developed in 2017 and used by the National Archives of France for building a proof of concept (https://piaaf.demo.logilab.fr). EGAD continued to develop the ontology, and this process entered a very active period in 2019, while RiC-CM v0.2 was being designed and edited. From December 2018 to November 2019, about 65 persons that responded to a call for reviewers, received successive beta versions of RiC-O and sent a few first comments. While EGAD RiC-O team could not answer to each of these comments, each was taken into account. RiC-O v0.1 was released on December 2019, at the same time as RiC-CM v0.2 preview. The Git repository that is used for handling RiC-O was made public in March 2020 (see https://github.com/ICA-EGAD/RiC-O). In 2020, RiC-CM v0.2 preview was significantly updated: the textual definitions of many entities were changed, as well as the specifications of many attributes; and the IRIs of lot of relations were changed, in order to take into account past situations and to adopt some simple naming rules. As a consequence, RiC-O had to be updated in order to remain compliant with RiC-CM. These changes could not be made before the end of 2020, when RiC-CM could be considered stable. EGAD also decided to make other changes in RiC-O, among which the most important are mentioned in bold in the following list. RiC-O 0.2 results from these updates and changes. It was released in February 2021, and is fully compliant with RiC-CM 0.2, which was released in July 2021. At the end of 2022, while the EGAD group, as part of the development of version 1.0 of RiC-CM, was working on analyzing and taking into account the very numerous comments relating to RiC-CM 0.2 received, a new active phase of development started for RiC-O. A team of no longer three, but six people prepared this version. It was then absolutely not a question of breaking with the principles and methods already used; the work was a continuation of what had …
type: NamedIndividual
type: Vocabulary

RiC-CM corresponding component
type: AnnotationProperty
comment: When it exists, specifies the identifier and name of RiC-CM component that corresponds to the annotated class or property.
label: componente correspondiente en RiC-CM @es
label: composant correspondant dans RiC-CM @fr
change note: Added a new rdfs:label in Spanish.
  date: 2023-11-25
change note: Added a new rdfs:label in French.
  date: 2023-08-28
sub property of: comment

close to
type: AnnotationProperty
comment: An annotation property for recording a possible mapping to a component in another model or ontology
label: cerca de @es
label: proche de @fr
change note: Added a new rdfs:label in Spanish.
  date: 2023-11-25
change note: Added a new rdfs:label in French.
  date: 2023-08-28
sub property of: comment

has the role of the Accumulation Relation
type: ObjectProperty
sub property of: has the role of the Organic Provenance Relation
domain: Accumulation Relation
range: Accumulation Relation
comment: Connects an AccumulationRelation to itself. It is a property that can stand for an instance of the class when necessary, e.g. when you explore a knowledge graph.
label: a le rôle de la Relation d’accumulation @fr
label: desempeña el papel de la Relación de Acumulación @es
change note: Removed global reflexivity (leads to inconsistency).
  date: 2024-08-02
change note:
  date: 2023-11-08
  value: In order to get a system of rolified Relation classes: created the object property, with domain and range the AccumulationRelation rolified class. Declared it as reflexive. Declared it(s) superproperty(ies).
scope note: This property "rolifies" the AccumulationRelation class. It should be used only when you have to manage instances of the AccumulationRelation class, to connect each instance to itself, in order to be able to infer, using OWL-RL and property paths, the two shortcuts corresponding to this n-ary class.

has the role of the Activity Documentation Relation
type: ObjectProperty
sub property of: has the role of the Event Relation
sub property of: has the role of the Organic or functional provenance Relation
domain: Activity Documentation Relation
range: Activity Documentation Relation
comment: Connects an ActivityDocumentationRelation to itself. It is a property that can stand for an instance of the class when necessary, e.g. when you explore a knowledge graph.
label: a le rôle de la Relation entre activités et ressources archivistiques @fr
label: desempeña el papel de la Relación de procedencia funcional @es
change note: Removed global reflexivity (leads to inconsistency).
  date: 2024-08-02
change note:
  date: 2023-11-08
  value: In order to get a system of rolified Relation classes: created the object property, with domain and range the ActivityDocumentationRelation rolified class. Declared it as reflexive. Declared it(s) superproperty(ies).
scope note: This property "rolifies" the ActivityDocumentationRelation class. It should be used only when you have to manage instances of the ActivityDocumentationRelation class, to connect each instance to itself, in order to be able to infer, using OWL-RL and property paths, the two shortcuts corresponding to this n-ary class.

activity is context of relation
type: ObjectProperty
sub property of: thing is context of relation
inverse of: as concerns activity
domain: Activity
range: Class
  union of: Agent Temporal Relation
  union of: Mandate Relation
comment: Connects an Activity to an Agent Temporal Relation (when the Activity is transferred from an Agent to another one) or a Mandate Relation (the Mandate assigns the Activity to the Agent or defines it).
label: actividad es contexto de relación @es
label: activité est le contexte de la relation @fr
change note: Added a new rdfs:label in Spanish.
  date: 2023-11-02
change note: Added a new rdfs:label in French.
  date: 2023-08-28

affects or affected
type: ObjectProperty
sub property of: has or had participant
inverse of: is or was affected by
domain: Event
range: Thing
comment: Connects an Event to a Thing on which the Event has or had some significant impact.
label: afecta o afectaba a @es
label: affecte ou a affecté @fr
change note: Added a new rdfs:label in Spanish.
  date: 2023-11-02
change note: Added a new rdfs:label in French.
  date: 2023-08-28
change note:
  date: 2021-01-22
  value: changed the IRI, label, inverse property IRI, text definition and corresponding CM component (changed made in order to make RiC-O compliant with RiC-CM 0.2; the name of this property in RiC-O 0.1 was "affects").
RiC-CM corresponding component: RiC-R059 ('affects or affected' relation)

has the role of the Agent Control Relation
type: ObjectProperty
sub property of: has the role of the Agent Hierarchical Relation
sub property of: has the role of the Authority Relation
domain: Agent Control Relation
range: Agent Control Relation
comment: Connects an AgentControlRelation to itself. It is a property that can stand for an instance of the class when necessary, e.g. when you explore a knowledge graph.
label: a le rôle de la Relation de contrôle entre agents @fr
label: desempeña el papel de la Relación de control entre agentes @es
change note: Removed global reflexivity (leads to inconsistency).
  date: 2024-08-02
change note:
  date: 2023-11-08
  value: In order to get a system of rolified Relation classes: created the object property, with domain and range the AgentControlRelation rolified class. Declared it as reflexive. Declared it(s) superproperty(ies).
scope note: This property "rolifies" the AgentControlRelation class. It should be used only when you have to manage instances of the AgentControlRelation class, to connect each instance to itself, in order to be able to infer, using OWL-RL and property paths, the two shortcuts corresponding to this n-ary class.

agent has or had location
type: ObjectProperty
sub property of: has or had location
sub property of: is agent associated with place
inverse of: is or was location of agent
domain: Agent
range: Place
comment: Inverse of 'is or was location of agent' object property.
label: agent a ou a eu pour localisation @fr
label: agente tiene o tenía como localización @es
change note: Added a new rdfs:label in Spanish.
  date: 2023-11-27
change note: Added a rdfs:comment.
  date: 2023-10-26
change note: Property created for RiC-0 1.0.
  date: 2023-10-20

has the role of the Agent Hierarchical Relation
type: ObjectProperty
sub property of: has the role of the Agent Relation
domain: Agent Hierarchical Relation
range: Agent Hierarchical Relation
comment: Connects an AgentHierarchicalRelation to itself. It is a property that can stand for an instance of the class when necessary, e.g. when you explore a knowledge graph.
label: a le rôle de la Relation hiérarchique entre agents @fr
label: desempeña el papel de la Relación jerárquica entre agentes @es
change note: Removed global reflexivity (leads to inconsistency).
  date: 2024-08-02
change note:
  date: 2023-11-08
  value: In order to get a system of rolified Relation classes: created the object property, with domain and range the AgentHierarchicalRelation rolified class. Declared it as reflexive. Declared it(s) superproperty(ies).
scope note: This property "rolifies" the AgentHierarchicalRelation class. It should be used only when you have to manage instances of the AgentHierarchicalRelation class, to connect each instance to itself, in order to be able to infer, using OWL-RL and property paths, the two shortcuts corresponding to this n-ary class.

has the role of the Agent Temporal Relation
type: ObjectProperty
sub property of: has the role of the Agent Relation
sub property of: has the role of the Temporal Relation
domain: Agent Temporal Relation
range: Agent Temporal Relation
comment: Connects an AgentTemporalRelation to itself. It is a property that can stand for an instance of the class when necessary, e.g. when you explore a knowledge graph.
label: a le rôle de la Relation temporelle entre agents @fr
label: desempeña el papel de la Relación temporal entre agentes @es
change note: Removed global reflexivity (leads to inconsistency).
  date: 2024-08-02
change note:
  date: 2023-11-08
  value: In order to get a system of rolified Relation classes: created the object property, with domain and range the AgentTemporalRelation rolified class. Declared it as reflexive. Declared it(s) superproperty(ies).
scope note: This property "rolifies" the AgentTemporalRelation class. It should be used only when you have to manage instances of the AgentTemporalRelation class, to connect each instance to itself, in order to be able to infer, using OWL-RL and property paths, the two shortcuts corresponding to this n-ary class.

has the role of the Agent Relation
type: ObjectProperty
sub property of: has the role of the Relation
domain: Agent Relation
range: Agent Relation
comment: Connects an AgentToAgentRelation to itself. It is a property that can stand for an instance of the class when necessary, e.g. when you explore a knowledge graph.
label: a le rôle de la Relation entre agents @fr
label: desempeña el papel de la Relación entre agentes @es
change note: Removed global reflexivity (leads to inconsistency).
  date: 2024-08-02
change note:
  date: 2023-11-08
  value: In order to get a system of rolified Relation classes: created the object property, with domain and range the AgentToAgentRelation rolified class. Declared it as reflexive. Declared it(s) superproperty(ies).
scope note: This property "rolifies" the AgentToAgentRelation class. It should be used only when you have to manage instances of the AgentToAgentRelation class, to connect each instance to itself, in order to be able to infer, using OWL-RL and property paths, the two shortcuts corresponding to this n-ary class.

has the role of the Appellation Relation
type: ObjectProperty
sub property of: has the role of the Relation
domain: Appellation Relation
range: Appellation Relation
comment: Connects an AppellationRelation to itself. It is a property that can stand for an instance of the class when necessary, e.g. when you explore a knowledge graph.
label: a le rôle de la Relation d’appellation @fr
label: desempeña el papel de la Relación de denominación @es
change note: Removed global reflexivity (leads to inconsistency).
  date: 2024-08-02
change note:
  date: 2023-11-08
  value: In order to get a system of rolified Relation classes: created the object property, with domain and range the AppellationRelation rolified class. Declared it as reflexive. Declared it(s) superproperty(ies).
scope note: This property "rolifies" the AppellationRelation class. It should be used only when you have to manage instances of the AppellationRelation class, to connect each instance to itself, in order to be able to infer, using OWL-RL and property paths, the two shortcuts corresponding to this n-ary class.

as concerns activity
type: ObjectProperty
sub property of: relation has context
inverse of: activity is context of relation
domain: Class
  union of: Agent Temporal Relation
  union of: Mandate Relation
range: Activity
comment: Connects an Agent Temporal Relation or Mandate Relation, to an Activity that is, either transferred from an Agent to another one, or assigned by a Mandate to an Agent.
label: en ce qui concerne l’activité @fr
label: en cuanto a actividad @es
change note: Added a new rdfs:label in Spanish.
  date: 2023-11-02
change note: Added a new rdfs:label in French.
  date: 2023-08-28

has the role of the Authority Relation
type: ObjectProperty
sub property of: has the role of the Relation
domain: Authority Relation
range: Authority Relation
comment: Connects an AuthorityRelation to itself. It is a property that can stand for an instance of the class when necessary, e.g. when you explore a knowledge graph.
label: a le rôle de la Relation d’autorité @fr
label: desempeña el papel de la Relación de control por parte de agentes @es
change note: Removed global reflexivity (leads to inconsistency).
  date: 2024-08-02
change note:
  date: 2023-11-08
  value: In order to get a system of rolified Relation classes: created the object property, with domain and range the AuthorityRelation rolified class. Declared it as reflexive. Declared it(s) superproperty(ies).
scope note: This property "rolifies" the AuthorityRelation class. It should be used only when you have to manage instances of the AuthorityRelation class, to connect each instance to itself, in order to be able to infer, using OWL-RL and property paths, the two shortcuts corresponding to this n-ary class.

authorized by
type: ObjectProperty
sub property of: is associated with rule
inverse of: authorizes
domain: Agent
range: Mandate
property chain axiom: thing is target of relation
property chain axiom: has the role of the Mandate Relation
property chain axiom: relation has source
comment: Inverse of 'authorizes' object property.
label: autorisé par @fr
label: controlado por @es
change note: In order to get a system of rolified Relation classes: modified the property chain axiom so that it now involves the new mandateRelation_role object property.
  date: 2023-11-08
change note: Added a new rdfs:label in Spanish.
  date: 2023-11-02
change note: Added a new rdfs:label in French.
  date: 2023-08-28
RiC-CM corresponding component: RiC-R067i ('authorizedBy' relation)

authorizes
type: ObjectProperty
sub property of: is rule associated with
inverse of: authorized by
domain: Mandate
range: Agent
property chain axiom: thing is source of relation
property chain axiom: has the role of the Mandate Relation
property chain axiom: relation has target
comment: Connects a Mandate to the Agent that the Mandate gives the authority or competencies to act.
label: autorise @fr
label: controla @es
change note: In order to get a system of rolified Relation classes: modified the property chain axiom so that it now involves the new mandateRelation_role object property.
  date: 2023-11-08
change note: Added a new rdfs:label in Spanish.
  date: 2023-11-02
change note: Added a new rdfs:label in French.
  date: 2023-08-28
change note: fixed the CM corresponding component name.
  date: 2021-01-22
RiC-CM corresponding component: RiC-R067 ('authorizes' relation)

authorizing agent
type: ObjectProperty
sub property of: relation has context
inverse of: is authorizing agent in mandate relation
domain: Mandate Relation
range: Agent
comment: Connects a Mandate Relation to an Agent that assigns the Mandate.
label: autorisation donnée par l’agent @fr
label: autorización dada por el agente @es
change note: Fixed the rdfs:label in Spanish.
  date: 2023-11-13
change note: Added a new rdfs:label in Spanish.
  date: 2023-11-02
change note: Added a new rdfs:label in French.
  date: 2023-08-28

has the role of the Authorship Relation
type: ObjectProperty
sub property of: has the role of the Creation Relation
domain: Authorship Relation
range: Authorship Relation
comment: Connects an AuthorshipRelation to itself. It is a property that can stand for an instance of the class when necessary, e.g. when you explore a knowledge graph.
label: a le rôle de la Relation de responsabilité intellectuelle @fr
label: desempeña el papel de la Relación de autoría @es
change note: Removed global reflexivity (leads to inconsistency).
  date: 2024-08-02
change note:
  date: 2023-11-08
  value: In order to get a system of rolified Relation classes: created the object property, with domain and range the AuthorshipRelation rolified class. Declared it as reflexive. Declared it(s) superproperty(ies).
scope note: This property "rolifies" the AuthorshipRelation class. It should be used only when you have to manage instances of the AuthorshipRelation class, to connect each instance to itself, in order to be able to infer, using OWL-RL and property paths, the two shortcuts corresponding to this n-ary class.

has the role of the Child Relation
type: ObjectProperty
sub property of: has the role of the Descendance Relation
domain: Child Relation
range: Child Relation
comment: Connects a ChildRelation to itself. It is a property that can stand for an instance of the class when necessary, e.g. when you explore a knowledge graph.
label: a le rôle de la Relation de filiation @fr
label: desempeña el papel de la Relación de filiación @es
change note: Removed global reflexivity (leads to inconsistency).
  date: 2024-08-02
change note: In order to get a system of rolified Relation classes: created the object property, with domain and range the ChildRelation rolified class. Declared it as reflexive. Declared it(s) superproperty(ies).
  date: 2023-11-08
scope note: This property "rolifies" the ChildRelation class. It should be used only when you have to manage instances of the ChildRelation class, to connect each instance to itself, in order to be able to infer, using OWL-RL and property paths, the two shortcuts corresponding to this n-ary class.

contained
type: ObjectProperty
sub property of: contains or contained
sub property of: had part
inverse of: was contained by
domain: Place
range: Place
comment: Connects a Place to a Place that it contained in the past.
label: a contenu @fr
label: contenía @es
change note: Added a new rdfs:label in Spanish.
  date: 2023-11-27
change note: Updated the labels, description (rdfs:comment).
  date: 2023-11-12
change note:
  date: 2023-09-05
  value: Object property added, along with its inverse property, in order to enable to express past partitive relations between places (the current partitive relations being also added, including a transitive one).

contains or contained
type: ObjectProperty
sub property of: has or had part
sub property of: is associated with place
sub property of: is place associated with
inverse of: is or was contained by
domain: Place
range: Place
comment: Connects a Place to a region that is or was within it.
label: contiene o contenía @es
label: contient ou a contenu @fr
change note: Added a new rdfs:label in Spanish.
  date: 2023-11-02
change note: Added a new rdfs:label in French.
  date: 2023-08-28
change note:
  date: 2021-01-22
  value: changed the IRI, label, inverse property IRI, text definition, corresponding CM component name ; added a scope note (changed made in order to make RiC-O compliant with RiC-CM 0.2; the name of this property in RiC-O 0.1 was "contains").
scope note: Use for connecting two geographical or administrative regions.
RiC-CM corresponding component: RiC-R007 ('contains or contained' relation)

contains transitive
type: ObjectProperty
sub property of: contains or contained
sub property of: has part transitive
type: TransitiveProperty
inverse of: is contained by transitive
domain: Place
range: Place
comment: Connects a Place to a Place that it contains, directly or indirectly. This is a transitive relation.
label: contiene transitivo @es
label: contient transitif @fr
change note: Added a new rdfs:label in Spanish.
  date: 2023-11-27
change note: Updated the description (rdfs:comment) and labels.
  date: 2023-11-12
change note: Object property added, along with its inverse property, in order to enable to express current partitive relations between places (the past partitive relation also being added).
  date: 2023-09-05

has the role of the Correspondence Relation
type: ObjectProperty
sub property of: has the role of the Knowing Relation
domain: Correspondence Relation
range: Correspondence Relation
comment: Connects a CorrespondenceRelation to itself. It is a property that can stand for an instance of the class when necessary, e.g. when you explore a knowledge graph.
label: a le rôle de la Relation épistolaire @fr
label: desempeña el papel de la Relación entre personas por correspondencia @es
change note: Removed global reflexivity (leads to inconsistency).
  date: 2024-08-02
change note:
  date: 2023-11-08
  value: In order to get a system of rolified Relation classes: created the object property, with domain and range the CorrespondenceRelation rolified class. Declared it as reflexive. Declared it(s) superproperty(ies).
scope note: This property "rolifies" the CorrespondenceRelation class. It should be used only when you have to manage instances of the CorrespondenceRelation class, to connect each instance to itself, in order to be able to infer, using OWL-RL and property paths, the two shortcuts corresponding to this n-ary class.

has the role of the Creation Relation
type: ObjectProperty
sub property of: has the role of the Organic Provenance Relation
domain: Creation Relation
range: Creation Relation
comment: Connects a CreationRelation to itself. It is a property that can stand for an instance of the class when necessary, e.g. when you explore a knowledge graph.
label: a le rôle de la Relation de création @fr
label: desempeña el papel de la Relación de creación @es
change note: Removed global reflexivity (leads to inconsistency).
  date: 2024-08-02
change note:
  date: 2023-11-08
  value: In order to get a system of rolified Relation classes: created the object property, with domain and range the CreationRelation rolified class. Declared it as reflexive. Declared it(s) superproperty(ies).
scope note: This property "rolifies" the CreationRelation class. It should be used only when you have to manage instances of the CreationRelation class, to connect each instance to itself, in order to be able to infer, using OWL-RL and property paths, the two shortcuts corresponding to this n-ary class.

creation with role
type: ObjectProperty
sub property of: relation has context
inverse of: role is context of creation relation
domain: Creation Relation
range: Role Type
comment: Connects a Creation Relation to the Role Type that the creator Agent(s) has in the creation process
label: creación con el rol de @es
label: création avec pour rôle @fr
change note: Added a new rdfs:label in Spanish.
  date: 2023-11-02
change note: Added a new rdfs:label in French.
  date: 2023-08-28

has the role of the Derivation Relation
type: ObjectProperty
sub property of: has the role of the Instantiation to Instantiation Relation
sub property of: has the role of the Temporal Relation
domain: Derivation Relation
range: Derivation Relation
comment: Connects a DerivationRelation to itself. It is a property that can stand for an instance of the class when necessary, e.g. when you explore a knowledge graph.
label: a le rôle de la Relation de dérivation @fr
label: desempeña el papel de la Relación de derivación @es
change note: Removed global reflexivity (leads to inconsistency).
  date: 2024-08-02
change note:
  date: 2023-11-08
  value: In order to get a system of rolified Relation classes: created the object property, with domain and range the DerivationRelation rolified class. Declared it as reflexive. Declared it(s) superproperty(ies).
scope note: This property "rolifies" the DerivationRelation class. It should be used only when you have to manage instances of the DerivationRelation class, to connect each instance to itself, in order to be able to infer, using OWL-RL and property paths, the two shortcuts corresponding to this n-ary class.

has the role of the Descendance Relation
type: ObjectProperty
sub property of: has the role of the Agent Temporal Relation
sub property of: has the role of the Family Relation
domain: Descendance Relation
range: Descendance Relation
comment: Connects a DescendanceRelation to itself. It is a property that can stand for an instance of the class when necessary, e.g. when you explore a knowledge graph.
label: a le rôle de la Relation de descendance @fr
label: desempeña el papel de la Relación de descendencia @es
change note: Removed global reflexivity (leads to inconsistency).
  date: 2024-08-02
change note:
  date: 2023-11-08
  value: In order to get a system of rolified Relation classes: created the object property, with domain and range the DescendanceRelation rolified class. Declared it as reflexive. Declared it(s) superproperty(ies).
scope note: This property "rolifies" the DescendanceRelation class. It should be used only when you have to manage instances of the DescendanceRelation class, to connect each instance to itself, in order to be able to infer, using OWL-RL and property paths, the two shortcuts corresponding to this n-ary class.

describes or described
type: ObjectProperty
sub property of: has or had subject
inverse of: is or was described by
domain: Record Resource
range: Thing
comment: Connects a Record Resource to a Thing that it describes or described.
label: décrit ou a décrit @fr
label: describe o describía @es
change note: Aligned with RiC-CM 1.0: updated the description (rdfs:comment).
  date: 2023-11-12
change note: Added a new rdfs:label in Spanish.
  date: 2023-11-02
change note: Added a new rdfs:label in French.
  date: 2023-08-28
change note:
  date: 2021-01-22
  value: changed the IRI, label, inverse property IRI, text definition, corresponding CM component name (changed made in order to make RiC-O compliant with RiC-CM 0.2; the name of this property in RiC-O 0.1 was "describes").
scope note: Can be used, among other situations, for specifying that some finding aid (a Record that has Documentary Form Type Finding Aid) describes some Record Set.
RiC-CM corresponding component: RiC-R021 ('describes or described' relation)

contains directly
type: ObjectProperty
sub property of: contains transitive
sub property of: has direct part
inverse of: is directly contained by
domain: Place
range: Place
comment: Connects a Place to another Place that it directly contains.
label: contiene directamente @es
label: contient directement @fr
change note: Added a new rdfs:label in Spanish.
  date: 2023-11-27
change note: Updated the description (rdfs:comment) and labels.
  date: 2023-11-12
change note:
  date: 2023-09-05
  value: Object property added, along with its inverse property, in order to enable to express current, direct, partitive relations between places (the possibly indirect, transitive relation, superproperty of this one, being also added).

directly follows in sequence
type: ObjectProperty
sub property of: follows in sequence transitive
inverse of: directly precedes in sequence
domain: Thing
range: Thing
property chain axiom: has proxy
property chain axiom: proxy directly follows in sequence
comment: Inverse of 'directly precedes in sequence' object property.
label: sigue directamente en la secuencia @es
label: suit directement dans la séquence @fr
change note: Fixed the property chain axiom.
  date: 2025-04-02
change note: Tweaked the rdfs:comment to simply refer to its inverse property. Also added a property chain axiom relating it to use of rico:Proxy.
  date: 2025-03-04
change note: Added a new rdfs:label in Spanish.
  date: 2023-11-27
change note: Updated the description (rdfs:comment) and labels.
  date: 2023-11-12
change note: Renamed the property and modified its definition (rdfs:comment) in order to better distinguish it from followsInTime.
  date: 2023-09-22
change note: Added transitive super-property and both present direct and past sequential relations as well as their respective inverse relations.
  date: 2023-09-08

directly follows proxy in sequence
type: ObjectProperty
sub property of: directly follows in sequence
sub property of: follows proxy in sequence
inverse of: proxy directly precedes in sequence
domain: Record Resource
range: Proxy
comment: Inverse of 'proxy directly precedes in sequence' object property.
label: sigue directamente el proxy en la secuencia @es
label: suit directement le proxy dans la séquence @fr
change note: Added the French and Spanish labels.
  date: 2025-04-02
change note: Introduced in RiC-O 1.1.
  date: 2025-03-04

directly includes
type: ObjectProperty
sub property of: has direct part
sub property of: includes transitive
inverse of: is directly included in
domain: Record Set
range: Class
  union of: Documento
  union of: Record Set
comment: Connects a Record Set to a Record or Record Set which it includes directly.
label: inclut directement @fr
label: incluye directamente @es
change note: Added a new rdfs:label in Spanish.
  date: 2023-11-27
change note: Updated the labels, description (rdfs:comment).
  date: 2023-11-12
change note:
  date: 2023-09-08
  value: Object property added, along with its inverse property, in order to enable to express current, direct, partitive relations between Record Sets and their members (the possibly indirect, transitive relation, superproperty of this one, being also added).

directly includes proxy
type: ObjectProperty
sub property of: has direct part
sub property of: includes proxy
inverse of: proxy is directly included in
domain: Record Set
range: Proxy
comment: Inverse of 'proxy is directly included in' object property.
label: inclut directement le proxy @fr
label: incluye directamente el proxy @es
change note: Added the French and Spanish labels.
  date: 2025-04-02
change note: Introduced in RiC-O 1.1.
  date: 2025-03-04

directly precedes in sequence
type: ObjectProperty
sub property of: precedes in sequence transitive
inverse of: directly follows in sequence
domain: Thing
range: Thing
property chain axiom: directly precedes proxy in sequence
property chain axiom: proxy for
comment: Connects a Thing to a Thing that it precedes directly in some sequence (not necessarily defined or characterised chronologically).
label: precede directamente en la secuencia @es
label: précède directement dans la séquence @fr
change note: Tweaked the rdfs:comment to try to clarify what is meant. Also added a property chain axiom relating it to use of rico:Proxy.
  date: 2025-03-04
change note: Added a new rdfs:label in Spanish.
  date: 2023-11-27
change note: Updated the description (rdfs:comment) and labels.
  date: 2023-11-12
change note: Renamed the property and modified its definition (rdfs:comment) in order to better distinguish it from precedesInTime.
  date: 2023-09-22
change note:
  date: 2023-09-08
  value: Object property added, along with its inverse property, in order to enable to express current, direct, sequential relations between things (the possibly indirect, transitive relation, superproperty of this one, being also added).

directly precedes proxy in sequence
type: ObjectProperty
sub property of: directly precedes in sequence
sub property of: precedes proxy in sequence
inverse of: proxy directly follows in sequence
domain: Record Resource
range: Proxy
comment: Connects a Record Resource to a Proxy of a Record Resource that it precedes directly in some sequence (not necessarily defined or characterised chronologically).
label: precede directamente el proxy en la secuencia @es
label: précède directement le proxy dans la séquence @fr
change note: Added the French and Spanish labels.
  date: 2025-04-02
change note: Introduced in RiC-O 1.1.
  date: 2025-03-04

documented by
type: ObjectProperty
sub property of: is organic or functional provenance of
sub property of: results or resulted in
inverse of: documents
domain: Activity
range: Class
  union of: Instantiation
  union of: Record Resource
property chain axiom: thing is target of relation
property chain axiom: has the role of the Activity Documentation Relation
property chain axiom: relation has source
comment: Inverse of 'documents' object property.
label: est documenté par @fr
label: se documenta en @es
change note: In order to get a system of rolified Relation classes: modified the property chain axiom so that it now involves the new activityDocumentationRelation_role object property.
  date: 2023-11-08
change note: Made this property a subproperty of the new isOrganicOrFunctionalProvenanceOf property.
  date: 2023-11-07
change note: Added a new rdfs:label in Spanish.
  date: 2023-11-02
change note: Added a new rdfs:label in French.
  date: 2023-08-28
change note: changed the inverse property IRI, the superproperty IRI and the corresponding CML component name
  date: 2021-01-22
RiC-CM corresponding component: RiC-R033i ('documented by' relation)

documents
type: ObjectProperty
sub property of: has organic or functional provenance
sub property of: results or resulted from
inverse of: documented by
domain: Class
  union of: Instantiation
  union of: Record Resource
range: Activity
property chain axiom: thing is source of relation
property chain axiom: has the role of the Activity Documentation Relation
property chain axiom: relation has target
comment: Connects a Record Resource or an Instantiation to the Activity that generates the Record Resource or Instantiation.
label: documenta @es
label: documente @fr
change note: Aligned with RiC-CM 1.0: updated the skos:scopeNote.
  date: 2023-11-12
change note: In order to get a system of rolified Relation classes: modified the property chain axiom so that it now involves the new activityDocumentationRelation_role object property.
  date: 2023-11-08
change note: Made this property a subproperty of the new hasOrganicOrFunctionalProvenance property.
  date: 2023-11-07
change note: Added a new rdfs:label in Spanish.
  date: 2023-11-02
change note: Added a new rdfs:label in French.
  date: 2023-08-28
change note:
  date: 2021-01-22
  value: changed the IRI, label, superproperty IRI, corresponding CM component name (changed made in order to make RiC-O compliant with RiC-CM 0.2; the name of this property in RiC-O 0.1 was "isDocumentationOf").
scope note: To be used to describe the functional provenance of a Record Resource or Instantiation.
RiC-CM corresponding component: RiC-R033 ('documents' relation)

has the role of the Event Relation
type: ObjectProperty
sub property of: has the role of the Relation
domain: Event Relation
range: Event Relation
comment: Connects an EventRelation to itself. It is a property that can stand for an instance of the class when necessary, e.g. when you explore a knowledge graph.
label: a le rôle de la Relation impliquant un événement @fr
label: desempeña el papel de la Relación con un evento @es
change note: Removed global reflexivity (leads to inconsistency).
  date: 2024-08-02
change note: In order to get a system of rolified Relation classes: created the object property, with domain and range the EventRelation rolified class. Declared it as reflexive. Declared it(s) superproperty(ies).
  date: 2023-11-08
scope note: This property "rolifies" the EventRelation class. It should be used only when you have to manage instances of the EventRelation class, to connect each instance to itself, in order to be able to infer, using OWL-RL and property paths, the two shortcuts corresponding to this n-ary class.

evidences
type: ObjectProperty
sub property of: thing is connected to relation
inverse of: is evidenced by
domain: Record Resource
range: Relation
comment: Connects a Record Resource to a Relation, when the first is used for proving the existence of the second one, or for describing it.
label: atteste de @fr
label: evidencia @es
change note:
  date: 2023-12-27
  value: Renamed the object property (was 'is source of') and reduced its domain to Record Resource (the domain was the union of Record Resource and Agent) and its range to Relation (the range was the union of Record Resource and Relation). Consequently updated the superproperty, the labels, and added a rico:RiCCMCorrespondingComponent. Same for the inverse object property.
change note: Added a new rdfs:label in Spanish.
  date: 2023-11-02
change note: Added a new rdfs:label in French.
  date: 2023-08-28
RiC-CM corresponding component: Inverse of 'is evidenced by' object property.

exists or existed in
type: ObjectProperty
sub property of: is agent associated with agent
inverse of: has or had position
domain: Position
range: Group
property chain axiom: thing is source of relation
property chain axiom: has the role of the Position to Group Relation
property chain axiom: relation has target
comment: Connects a Position to a Group in which that Position exists or existed, or that is defined by that Group's organizational structure.
label: existe o existía en @es
label: existe ou a existé dans @fr
change note: Corrected unparseable symbol in rdfs:comment
  date: 2024-03-15
change note: In order to get a system of rolified Relation classes: modified the property chain axiom so that it now involves the new positionToGroupRelation_role object property.
  date: 2023-11-08
change note: Added a new rdfs:label in Spanish.
  date: 2023-11-02
change note: Added a new rdfs:label in French.
  date: 2023-08-28
change note:
  date: 2021-01-22
  value: changed the IRI, label, inverse property IRI, text definition, corresponding CM component name (changed made in order to make RiC-O compliant with RiC-CM 0.2; the name of this property in RiC-O 0.1 was "existsIn").
RiC-CM corresponding component: RiC-R056 ('exists or existed in' relation)

expresses or expressed
type: ObjectProperty
sub property of: is associated with rule
inverse of: is or was expressed by
domain: Record Resource
range: Rule
comment: Inverse of 'is or was expressed by' object property.
label: expresa o expresaba @es
label: exprime ou a exprimé @fr
change note: Added a new rdfs:label in Spanish.
  date: 2023-11-02
change note: Added a new rdfs:label in French.
  date: 2023-08-28
change note:
  date: 2021-01-22
  value: changed the IRI, label, inverse property IRI, text definition, corresponding CM component name (changed made in order to make RiC-O compliant with RiC-CM 0.2; the name of this property in RiC-O 0.1 was "expresses").
RiC-CM corresponding component: RiC-R064i ('expresses or expressed' relation)

has the role of the Family Relation
type: ObjectProperty
sub property of: has the role of the Agent Relation
domain: Family Relation
range: Family Relation
comment: Connects a FamilyRelation to itself. It is a property that can stand for an instance of the class when necessary, e.g. when you explore a knowledge graph.
label: a le rôle de la Relation familiale @fr
label: desempeña el papel de la Relación familiar @es
change note: Removed global reflexivity (leads to inconsistency).
  date: 2024-08-02
change note: Corrected unparseable symbol in rdfs:comment
  date: 2024-03-15
change note:
  date: 2023-11-08
  value: In order to get a system of rolified Relation classes: created the object property, with domain and range the FamilyRelation rolified class. Declared it as reflexive. Declared it(s) superproperty(ies).
scope note: This property "rolifies" the FamilyRelation class. It should be used only when you have to manage instances of the FamilyRelation class, to connect each instance to itself, in order to be able to infer, using OWL-RL and property paths, the two shortcuts corresponding to this n-ary class.

followed in sequence
type: ObjectProperty
sub property of: follows or followed
inverse of: preceded in sequence
domain: Thing
range: Thing
comment: Connects a Thing to a Thing that it followed in some sequence (not necessarily defined or characterised chronologically) in the past.
label: a suivi dans la séquence @fr
label: seguía en la secuencia transitivo @es
change note: Tweaked the rdfs:comment to try to clarify what is meant.
  date: 2025-03-04
change note: Added a new rdfs:label in Spanish.
  date: 2023-11-27
change note: Updated the description (rdfs:comment) and labels.
  date: 2023-11-12
change note: Renamed the property and modified its definition (rdfs:comment) in order to better distinguish it from followsInTime.
  date: 2023-09-22
change note: Added transitive super-property and both present direct and past sequential relations as well as their respective inverse relations.
  date: 2023-09-08

follows in sequence transitive
type: ObjectProperty
sub property of: follows or followed
type: TransitiveProperty
inverse of: precedes in sequence transitive
domain: Thing
range: Thing
property chain axiom: has proxy
property chain axiom: proxy follows in sequence
comment: Inverse of 'precedes in sequence transitive' object property.
label: sigue en la secuencia transitivo @es
label: suit dans la séquence transitif @fr
change note: Tweaked the rdfs:comment to simply refer to its inverse property. Also added a property chain axiom relating it to use of rico:Proxy.
  date: 2025-03-04
change note: Added a new rdfs:label in Spanish.
  date: 2023-11-27
change note: Updated the description (rdfs:comment) and labels.
  date: 2023-11-12
change note: Renamed the property and modified its definition (rdfs:comment) in order to better distinguish it from followsInTime.
  date: 2023-09-22
change note: Added transitive super-property and both present direct and past sequential relations as well as their respective inverse relations.
  date: 2023-09-08

follows in time
type: ObjectProperty
sub property of: follows or followed
type: TransitiveProperty
inverse of: precedes in time
domain: Thing
range: Thing
property chain axiom: thing is target of relation
property chain axiom: has the role of the Temporal Relation
property chain axiom: relation has source
comment: Inverse of 'precedes in time' object property. This is a transitive relation.
label: sigue en el tiempo a @es
label: suit dans le temps @fr
change note: In order to get a system of rolified Relation classes: modified the property chain axiom so that it now involves the new temporalRelation_role object property.
  date: 2023-11-08
change note: Added a new rdfs:label in Spanish.
  date: 2023-11-02
change note: Property made transitive.
  date: 2023-09-22
change note: Added a new rdfs:label in French.
  date: 2023-08-28
change note: changed the superproperty IRI.
  date: 2021-01-22
RiC-CM corresponding component: RiC-R009i ('follows in time' relation)

follows or followed
type: ObjectProperty
sub property of: is related to
inverse of: precedes or preceded
domain: Thing
range: Thing
property chain axiom: thing is target of relation
property chain axiom: has the role of the Sequential Relation
property chain axiom: relation has source
comment: Inverse of 'precedes or preceded' object property.
label: sigue o seguía a @es
label: suit ou a suivi @fr
change note: In order to get a system of rolified Relation classes: modified the property chain axiom so that it now involves the new sequentialRelation_role object property.
  date: 2023-11-08
change note: Added a new rdfs:label in Spanish.
  date: 2023-11-02
change note: Added a new rdfs:label in French.
  date: 2023-08-28
change note:
  date: 2021-01-22
  value: changed the IRI, label, inverse property IRI, text definition, corresponding CM component name (changed made in order to make RiC-O compliant with RiC-CM 0.2; the name of this property in RiC-O 0.1 was "follows").
RiC-CM corresponding component: RiC-R008i ('follows or followed' relation)

follows proxy in sequence
type: ObjectProperty
sub property of: follows in sequence transitive
inverse of: proxy precedes in sequence
domain: Record Resource
range: Proxy
comment: Inverse of 'proxy precedes in sequence' object property.
label: sigue el proxy en la secuencia @es
label: suit le proxy dans la séquence @fr
change note: Added the French and Spanish labels.
  date: 2025-04-02
change note: Introduced in RiC-O 1.1.
  date: 2025-03-04

has the role of the Functional Equivalence Relation
type: ObjectProperty
sub property of: has the role of the Instantiation to Instantiation Relation
domain: Functional Equivalence Relation
range: Functional Equivalence Relation
comment: Connects a FunctionalEquivalenceRelation to itself. It is a property that can stand for an instance of the class when necessary, e.g. when you explore a knowledge graph.
label: a le rôle de la Relation d’équivalence fonctionnelle @fr
label: desempeña el papel de la Relación de equivalencia funcional @es
change note: Removed global reflexivity (leads to inconsistency).
  date: 2024-08-02
change note:
  date: 2023-11-08
  value: In order to get a system of rolified Relation classes: created the object property, with domain and range the FunctionalEquivalenceRelation rolified class. Declared it as reflexive. Declared it(s) superproperty(ies).
scope note: This property "rolifies" the FunctionalEquivalenceRelation class. It should be used only when you have to manage instances of the FunctionalEquivalenceRelation class, to connect each instance to itself, in order to be able to infer, using OWL-RL and property paths, the two shortcuts corresponding to this n-ary class.

has the role of the Group Subdivision Relation
type: ObjectProperty
sub property of: has the role of the Agent Hierarchical Relation
sub property of: has the role of the Whole Part Relation
domain: Group Subdivision Relation
range: Group Subdivision Relation
comment: Connects a GroupSubdivisionRelation to itself. It is a property that can stand for an instance of the class when necessary, e.g. when you explore a knowledge graph.
label: a le rôle de la Relation de subdivision entre groupes d’agents @fr
label: desempeña el papel de la Relación de subdivisión entre grupos de agentes @es
change note: Removed global reflexivity (leads to inconsistency).
  date: 2024-08-02
change note:
  date: 2023-11-08
  value: In order to get a system of rolified Relation classes: created the object property, with domain and range the GroupSubdivisionRelation rolified class. Declared it as reflexive. Declared it(s) superproperty(ies).
scope note: This property "rolifies" the GroupSubdivisionRelation class. It should be used only when you have to manage instances of the GroupSubdivisionRelation class, to connect each instance to itself, in order to be able to infer, using OWL-RL and property paths, the two shortcuts corresponding to this n-ary class.

had component
type: ObjectProperty
sub property of: had part
sub property of: has or had component
inverse of: was component of
domain: Instantiation
range: Instantiation
comment: Connects an Instantiation to another Instantiation that was its component in the past.
label: a eu pour composant @fr
label: tenía como componente @es
change note: Added a new rdfs:label in Spanish.
  date: 2023-11-27
change note: Updated the description (rdfs:comment) and labels.
  date: 2023-11-12
change note:
  date: 2023-09-08
  value: Object property added, along with its inverse property, in order to enable to express past partitive relations between instantiations (the current partitive relations being also added, including a transitive one).

had constituent
type: ObjectProperty
sub property of: had part
sub property of: has or had constituent
inverse of: was constituent of
domain: Class
  union of: Documento
  union of: Record Part
range: Class
  union of: Documento
  union of: Record Part
comment: Connects a Record or Record Part to another Record or Record Part that was its constituent in the past.
label: a eu pour constituant @fr
label: tenía como elemento constitutivo @es
change note: Added a new rdfs:label in Spanish.
  date: 2023-11-27
change note: Updated the labels.
  date: 2023-11-12
change note: Added RecordPart to the domain.
  date: 2023-10-26
change note:
  date: 2023-09-08
  value: Object property added, along with its inverse property, in order to enable to express past partitive relations between Record and Record or Record Part (the current partitive relations being also added, including a transitive one).

had part
type: ObjectProperty
sub property of: has or had part
inverse of: was part of
domain: Thing
range: Thing
comment: Connects a Thing to a Thing that was a constitutive or component part of that Thing in the past.
label: a eu pour partie @fr
label: tenía como parte @es
change note: Added a new rdfs:label in Spanish.
  date: 2023-11-27
change note: Updated the labels.
  date: 2023-11-12
change note:
  date: 2023-07-12
  value: Object property added, along with its inverse property, in order to enable to express past partitive relations between things (the current partitive relations being also added, including a transitive one).

had subdivision
type: ObjectProperty
sub property of: had part
sub property of: had subordinate
sub property of: has or had subdivision
inverse of: was subdivision of
domain: Group
range: Group
comment: Connects a Group to one of its past subdivisions.
label: a eu pour subdivision @fr
label: tenía como subdivisión @es
change note: Added a new rdfs:label in Spanish.
  date: 2023-11-27
change note: Updated the labels.
  date: 2023-11-12
change note:
  date: 2023-09-08
  value: Object property added, along with its inverse property, in order to enable to express past partitive relations between groups (the current partitive relations being also added, including a transitive one).

had subevent
type: ObjectProperty
sub property of: had part
sub property of: has or had subevent
inverse of: was subevent of
domain: Event
range: Event
comment: Connects a past Event to one of a series of past Events that constituted that original, broader, past Event.
label: a été constitué de l’événement @fr
label: tenía como parte de evento @es
change note: Added a new rdfs:label in Spanish.
  date: 2023-11-27
change note: Updated the labels.
  date: 2023-11-12
change note:
  date: 2023-09-08
  value: Object property added, along with its inverse property, in order to enable to express partitive relations between past Events (the partitive relations between ongoing events being also added, including a transitive one).

had subordinate
type: ObjectProperty
sub property of: has or had subordinate
inverse of: was subordinate to
domain: Agent
range: Agent
comment: Connects an Agent to an Agent that was hierarchically inferior in the past.
label: a eu pour subalterne @fr
label: tenía como subordinado o subordinada a @es
change note: Added a new rdfs:label in Spanish.
  date: 2023-11-27
change note: Updated the labels.
  date: 2023-11-12
change note:
  date: 2023-09-08
  value: Object property added, along with its inverse property, in order to enable to express past subordination relations between Agents (the current subordination relations being also added, including a transitive one).

has accumulation date
type: ObjectProperty
sub property of: has organic provenance date
inverse of: is accumulation date of
domain: Class
  union of: Instantiation
  union of: Record Resource
range: Date
property chain axiom: thing is source of relation
property chain axiom: has the role of the Accumulation Relation
property chain axiom: relation has date
comment: Inverse of 'is accumulation date of' object property.
label: a pour date d'accumulation @fr
label: tiene como fecha de acumulación @es
change note: Connect to AccumulationRelation via a sub-property chain, and make a sub-property of the new object property 'hasOrganicProvenanceDate'.
  date: 2024-12-19
change note: Added in RiC-O 1.1.
  date: 2024-10-04

has accumulator
type: ObjectProperty
sub property of: has organic provenance
inverse of: is accumulator of
domain: Class
  union of: Instantiation
  union of: Record Resource
range: Agent
property chain axiom: thing is source of relation
property chain axiom: has the role of the Accumulation Relation
property chain axiom: relation has target
comment: Connects a Record Resource or an Instantiation to the Agent that accumulates it, be it intentionally (collecting) or not (receiving in the course of its activities).
label: est accumulé par @fr
label: tiene como acumulador a @es
change note: In order to get a system of rolified Relation classes: modified the property chain axiom so that it now involves the new accumulationRelation_role object property.
  date: 2023-11-08
change note: Added a new rdfs:label in Spanish.
  date: 2023-11-02
change note: Added a new rdfs:label in French.
  date: 2023-08-28
change note:
  date: 2021-01-22
  value: changed the IRI, label, inverse property IRI, text definition and corresponding CM component (changed made in order to make RiC-O compliant with RiC-CM 0.2; the name of this property in RiC-O 0.1 was "accumulatedBy").
RiC-CM corresponding component: RiC-R028 ('has accumulator' relation)

has activity type
type: ObjectProperty
sub property of: has or had type
inverse of: is activity type of
domain: Activity
range: Activity Type
comment: Connects an Activity to an Activity Type that categorizes it.
label: a pour type d’activité @fr
label: tiene como tipo de actividad @es
change note: Fixed the Spanish label.
  date: 2025-04-06
change note: Added a new rdfs:label in Spanish.
  date: 2023-11-02
change note: Added a new rdfs:label in French.
  date: 2023-08-28
change note: changed the superproperty IRI.
  date: 2021-01-22

has addressee
type: ObjectProperty
sub property of: has organic provenance
inverse of: is addressee of
domain: Class
  union of: Instantiation
  union of: Record Resource
range: Agent
comment: Connects a Record Resource or an Instantiation to the Agent that it is addressed to.
label: a pour destinataire @fr
label: se dirige a @es
change note: Added a new rdfs:label in Spanish.
  date: 2023-11-02
change note: Added a new rdfs:label in French.
  date: 2023-08-28
change note: added a scope note
  date: 2021-01-22
scope note: The identity of the addressee is (usually) evidenced by the Record Resource or Instantiation itself.
RiC-CM corresponding component: RiC-R032 ('has addressee' relation)

has ancestor
type: ObjectProperty
sub property of: has family association with
sub property of: is successor of
type: TransitiveProperty
inverse of: has descendant
domain: Person
range: Person
property chain axiom: thing is target of relation
property chain axiom: has the role of the Descendance Relation
property chain axiom: relation has source
comment: Inverse of 'has descendant' object property. This is a transitive relation.
label: a pour ancêtre @fr
label: tiene como ancestro a @es
change note: In order to get a system of rolified Relation classes: modified the property chain axiom so that it now involves the new descendanceRelation_role object property.
  date: 2023-11-08
change note: Added a new rdfs:label in Spanish.
  date: 2023-11-02
change note: made property transitive
  date: 2023-09-08
change note: Added a new rdfs:label in French.
  date: 2023-08-28
change note: changed the superproperty IRIs.
  date: 2021-01-22
RiC-CM corresponding component: RiC-R017i (has ancestor relation)

has author
type: ObjectProperty
sub property of: has creator
inverse of: is author of
domain: Documento
range: Class
  union of: Group
  union of: Person
  union of: Position
property chain axiom: thing is source of relation
property chain axiom: has the role of the Authorship Relation
property chain axiom: relation has target
comment: Connects a Record to the Group, Person or Position that is responsible for conceiving and formulating the information contained in the Record.
label: a pour responsable intellectuel @fr
label: tiene como autor a @es
change note: Aligned with RiC-CM 1.0: updated the skos:scopeNote.
  date: 2023-11-12
change note: In order to get a system of rolified Relation classes: modified the property chain axiom so that it now involves the new authorshipRelation_role object property.
  date: 2023-11-08
change note: Added a new rdfs:label in Spanish.
  date: 2023-11-02
change note: Added a new rdfs:label in French.
  date: 2023-08-28
change note: Created following the addition of RiC-R079 relation in RiC-CM 0.2
  date: 2020-12-29
scope note: To be used for a Person, Group or Position that makes any contribution to the content of a record. Includes the Person, Group or Position in whose name or by whose command the content may have been formulated and first instantiated (for example the Person who signed the Record).
RiC-CM corresponding component: RiC-R079 ('has author' relation)

has beginning date
type: ObjectProperty
sub property of: is associated with date
inverse of: is beginning date of
domain: Thing
range: Date
comment: Inverse of 'is beginning date of' object property.
label: a pour date de début @fr
label: tiene como fecha de inicio @es
change note: Added a new rdfs:label in Spanish.
  date: 2023-11-02
change note: Added a new rdfs:label in French.
  date: 2023-08-28
RiC-CM corresponding component: RiC-R069i ('has beginning date' relation)

has birth date
type: ObjectProperty
sub property of: has beginning date
inverse of: is birth date of
domain: Person
range: Date
comment: Inverse of 'is birth date of' object property.
label: a pour date de naissance @fr
label: tiene como fecha de nacimiento @es
change note: Added a new rdfs:label in Spanish.
  date: 2023-11-02
change note: Added a new rdfs:label in French.
  date: 2023-08-28
RiC-CM corresponding component: RiC-R070i ('has birth date' relation)

has birth place
type: ObjectProperty
sub property of: is agent associated with place
inverse of: is birth place of
domain: Person
range: Place
comment: Inverse of 'is birth place of' object property.
label: a pour lieu de naissance @fr
label: tiene como lugar de nacimiento @es
change note: Added a new rdfs:label in Spanish.
  date: 2023-11-27
change note: Updated the description (rdfs:comment).
  date: 2023-11-12
change note: Fixed the domain of the property.
  date: 2023-10-26
change note: Added for RiC-O 1.0.
  date: 2023-10-19

has carrier type
type: ObjectProperty
sub property of: has or had type
inverse of: is carrier type of
domain: Instantiation
range: Carrier Type
comment: Connects an Instantiation to a Carrier Type which categorizes its carrier.
label: a pour type de support @fr
label: tiene como tipo de soporte @es
change note: Added a new rdfs:label in Spanish.
  date: 2023-11-02
change note: Added a new rdfs:label in French.
  date: 2023-08-28
change note: changed the superproperty IRI.
  date: 2021-01-22

has child
type: ObjectProperty
sub property of: has descendant
inverse of: is child of
domain: Person
range: Person
property chain axiom: thing is source of relation
property chain axiom: has the role of the Child Relation
property chain axiom: relation has target
comment: Connects a Person to one of their children.
label: a pour enfant @fr
label: tiene como hijo o hija a @es
change note: In order to get a system of rolified Relation classes: modified the property chain axiom so that it now involves the new childRelation_role object property.
  date: 2023-11-08
change note: Added a new rdfs:label in Spanish.
  date: 2023-11-02
change note: Added a new rdfs:label in French.
  date: 2023-08-28
change note: changed the inverse property IRI.
  date: 2021-01-22
RiC-CM corresponding component: RiC-R018 ('has child' relation)

has collector
type: ObjectProperty
sub property of: has accumulator
inverse of: is collector of
domain: Class
  union of: Instantiation
  union of: Record Resource
range: Agent
comment: Connects a Record Resource or an Instantiation to the Agent that collects it intentionally, i.e., the Agent is a collector.
label: est collecté par @fr
label: tiene como coleccionista a @es
change note: Aligned with RiC-CM 1.0: updated the description (rdfs:comment).
  date: 2023-11-12
change note: Added a new rdfs:label in Spanish.
  date: 2023-11-02
change note: Added a new rdfs:label in French.
  date: 2023-08-28
change note:
  date: 2021-01-22
  value: changed the IRI, label, inverse property and super property IRI, text definition, domain (changed made in order to make RiC-O compliant with RiC-CM 0.2; the name of this property in RiC-O 0.1 was "collectedBy").
RiC-CM corresponding component: RiC-R030 ('has collector' relation)

has component transitive
type: ObjectProperty
sub property of: has or had component
sub property of: has part transitive
type: TransitiveProperty
inverse of: is component of transitive
domain: Instantiation
range: Instantiation
comment: Connects an Instantiation to another Instantiation that is, directly or indirectly, a component of that Instantiation. This is a transitive relation.
label: a pour composant transitif @fr
label: tiene como componente transitivo @es
change note: Added a new rdfs:label in Spanish.
  date: 2023-11-27
change note: Updated the description (rdfs:comment) and labels.
  date: 2023-11-12
change note: Object property added, along with its inverse property, in order to enable to express current partitive relations between instantiations (the past partitive relation also being added).
  date: 2023-09-08

has constituent proxy
type: ObjectProperty
sub property of: has part transitive
inverse of: proxy is constituent of
domain: Class
  union of: Documento
  union of: Record Part
range: Proxy
property chain axiom: proxy has constituent proxy transitive
comment: Inverse of 'proxy is constituent of' object property.
label: a pour constituant le proxy @fr
label: tiene como elemento constitutivo el proxy @es
change note: Added the French and Spanish labels.
  date: 2025-04-02
change note: Fixed the owl:subPropertyOf (was set to isPartOfTransitive).
  date: 2025-04-02
change note: Introduced in RiC-O 1.1.
  date: 2025-03-04

has constituent transitive
type: ObjectProperty
sub property of: has or had constituent
sub property of: has part transitive
type: TransitiveProperty
inverse of: is constituent of transitive
domain: Class
  union of: Documento
  union of: Record Part
range: Class
  union of: Documento
  union of: Record Part
property chain axiom: has constituent proxy
property chain axiom: proxy has constituent
comment: Connects a Record or Record Part to another Record or Record Part that is its constituent, directly or indirectly. This is a transitive relation.
label: a pour constituant transitif @fr
label: tiene como elemento constitutivo transitivo @es
change note: Added a property chain axiom relating it to use of rico:Proxy.
  date: 2025-03-04
change note: Added a new rdfs:label in Spanish.
  date: 2023-11-27
change note: Updated the description (rdfs:comment) and labels.
  date: 2023-11-12
change note: Added RecordPart to the domain.
  date: 2023-10-26
change note:
  date: 2023-09-08
  value: Object property added, along with its inverse property, in order to enable to express current partitive relations between records and other records or record parts (the past partitive relation also being added).

has content of type
type: ObjectProperty
sub property of: has or had type
inverse of: is content type of
domain: Class
  union of: Documento
  union of: Record Part
range: Content Type
comment: Connects a Record or a Record Part to a Content Type which categorizes its content.
label: a pour type de contenu @fr
label: tiene como tipo de contenido @es
change note: Added a new rdfs:label in Spanish.
  date: 2023-11-02
change note: Added a new rdfs:label in French.
  date: 2023-08-28
change note: changed the text definition and superproperty IRI.
  date: 2021-01-22

has content which mainly represents
type: ObjectProperty
sub property of: has content which represents
sub property of: has or had main subject
inverse of: is main thing represented by content of
domain: Class
  union of: Documento
  union of: Record Part
range: Thing
comment: Connects a Record or a Record Part to a Thing that its content mainly represents.
label: a un contenu qui représente principalement @fr
label: tiene contenido que representa principalmente @es
change note: Introduced in RiC-O 1.1.
  date: 2025-04-04
scope note: A common use case would be to connect a photograph of a person (a portrait) and the person represented.

has content which represents
type: ObjectProperty
sub property of: has or had subject
inverse of: is represented by content of
domain: Class
  union of: Documento
  union of: Record Part
range: Thing
comment: Connects a Record or a Record Part to a Thing that its content represents.
label: a un contenu qui représente @fr
label: tiene contenido que representa @es
change note: Introduced in RiC-O 1.1.
  date: 2025-04-04
scope note: Can be used for visual Records or Record Parts, like photographs, drawings, engravings, miniatures...

has copy
type: ObjectProperty
sub property of: has genetic link to record resource
sub property of: precedes in time
inverse of: is copy of
domain: Record Resource
range: Record Resource
comment: Connects a Record Resource to a copy of that Record Resource.
label: a pour copie @fr
label: tiene como copia @es
change note: Aligned with RiC-CM 1.0: updated the skos:scopeNote.
  date: 2023-11-12
change note: Added a new rdfs:label in Spanish.
  date: 2023-11-02
change note: Added a new rdfs:label in French.
  date: 2023-08-28
scope note: Is both a temporal and genetic relation between the two Record Resources.
RiC-CM corresponding component: RiC-R012 ('has copy' relation)

has creation date
type: ObjectProperty
sub property of: has beginning date
sub property of: has organic provenance date
inverse of: is creation date of
domain: Class
  union of: Instantiation
  union of: Record Resource
range: Date
property chain axiom: thing is source of relation
property chain axiom: has the role of the Creation Relation
property chain axiom: relation has date
comment: Inverse of 'is creation date of' object property
label: a pour date de création @fr
label: tiene como fecha de creación @es
change note: Connect to CreationRelation via a sub-property chain, and make a sub-property of the new object property 'hasOrganicProvenanceDate'.
  date: 2024-12-19
change note: Added a new rdfs:label in Spanish.
  date: 2023-11-27
change note: Added in RiC-O 1.0.
  date: 2023-09-22
RiC-CM corresponding component: RiC-R080i ('has creation date' relation)

has creator
type: ObjectProperty
sub property of: has organic provenance
inverse of: is creator of
domain: Class
  union of: Instantiation
  union of: Record Resource
range: Agent
property chain axiom: thing is source of relation
property chain axiom: has the role of the Creation Relation
property chain axiom: relation has target
comment: Connects a Record Resource or an Instantiation to an Agent that is either responsible for all or some of the content of the Record Resource or is a contributor to the genesis or production of an Instantiation.
label: a pour créateur @fr
label: tiene como creador a @es
change note: Added the property chain axiom, that had been forgotten.
  date: 2023-12-29
change note: Added a new rdfs:label in Spanish.
  date: 2023-11-02
change note: Added a new rdfs:label in French.
  date: 2023-08-28
change note: changed the IRI and label (changed made in order to make RiC-O compliant with RiC-CM 0.2; the name of this property in RiC-O 0.1 was "createdBy").
  date: 2021-01-22
scope note: Covers the definition of author in diplomatics, and any contribution to the intellectual content of a Record Resource.
RiC-CM corresponding component: RiC-R027 ('has creator' relation)

has date type
type: ObjectProperty
sub property of: has or had type
inverse of: is date type of
domain: Date
range: Date Type
comment: Connects a Date to its Date Type.
label: a pour type de date @fr
label: tiene como tipo de fecha @es
change note: Added a new rdfs:label in Spanish.
  date: 2023-11-27
change note: Added a rdfs:comment and a French rdfs:label.
  date: 2023-10-10
change note: Added in RiC-O 1.0.
  date: 2023-09-22

has death date
type: ObjectProperty
sub property of: has end date
inverse of: is death date of
domain: Person
range: Date
comment: Inverse of 'is death date of' object property.
label: a pour date de décès @fr
label: tiene como fecha de muerte @es
change note: Added a new rdfs:label in Spanish.
  date: 2023-11-02
change note: Added a new rdfs:label in French.
  date: 2023-08-28
RiC-CM corresponding component: RiC-R072i ('has death date' relation)

has death place
type: ObjectProperty
sub property of: is agent associated with place
inverse of: is death place of
domain: Person
range: Place
comment: Inverse of 'is death place of' object property.
label: a pour lieu de décès @fr
label: tiene como lugar de muerte @es
change note: Added a new rdfs:label in Spanish.
  date: 2023-11-27
change note: Added a rdfs:comment.
  date: 2023-11-13
change note: Fixed the domain of the property.
  date: 2023-10-26
change note: Added for RiC-O v1.0.
  date: 2023-10-19

has derivation date
type: ObjectProperty
sub property of: is associated with date
inverse of: is derivation date of
domain: Instantiation
range: Date
property chain axiom: thing is source of relation
property chain axiom: has the role of the Derivation Relation
property chain axiom: relation has date
comment: Inverse of 'is derivation date of' object property.
label: a pour date de dérivation @fr
label: tiene como fecha de derivación @es
change note: Added the property chain axiom.
  date: 2025-03-13
change note: Added in RiC-O 1.1.
  date: 2025-03-01

has descendant
type: ObjectProperty
sub property of: has family association with
sub property of: has successor
type: TransitiveProperty
inverse of: has ancestor
domain: Person
range: Person
property chain axiom: thing is source of relation
property chain axiom: has the role of the Descendance Relation
property chain axiom: relation has target
comment: Connects a Person to one of their descendants. This is a transitive relation.
label: a pour descendant @fr
label: tiene como descendiente a @es
change note: Aligned with RiC-CM 1.0: updated the skos:scopeNote.
  date: 2023-11-12
change note: In order to get a system of rolified Relation classes: modified the property chain axiom so that it now involves the new descendanceRelation_role object property.
  date: 2023-11-08
change note: Added a new rdfs:label in Spanish.
  date: 2023-11-02
change note: made property transitive
  date: 2023-09-08
change note: Added a new rdfs:label in French.
  date: 2023-08-28
change note: changed the superproperties IRIs.
  date: 2021-01-22
scope note: There may be zero to many intermediate persons, ignored or unknown, between the two connected persons.
RiC-CM corresponding component: RiC-R017 ('has descendant' relation)

has destruction date
type: ObjectProperty
sub property of: has end date
inverse of: is destruction date of
domain: Class
  union of: Instantiation
  union of: Record Resource
range: Date
comment: Inverse of 'is destruction date of' object property.
label: a pour date de destruction @fr
label: tiene como fecha de destrucción @es
change note: Changed domain.
  date: 2025-02-19
change note: Added a new rdfs:label in Spanish.
  date: 2023-11-27
change note: Added a rdfs:comment; same to the inverse property.
  date: 2023-10-14
change note: Renamed deletion into destruction
  date: 2023-10-12
change note: Added in RiC-O 1.0.
  date: 2023-09-22

has direct component
type: ObjectProperty
sub property of: has component transitive
sub property of: has direct part
inverse of: is direct component of
domain: Instantiation
range: Instantiation
comment: Connects an Instantiation to another Instantiation that is its direct component.
label: a directement pour composant @fr
label: tiene directamente como componente @es
change note: Added a new rdfs:label in Spanish.
  date: 2023-11-27
change note: Updated the labels.
  date: 2023-11-12
change note:
  date: 2023-09-08
  value: Object property added, along with its inverse property, in order to enable to express current, direct, partitive relations between instantiations (the possibly indirect, transitive relation, superproperty of this one, being also added).

has direct constituent
type: ObjectProperty
sub property of: has constituent transitive
sub property of: has direct part
inverse of: is direct constituent of
domain: Class
  union of: Documento
  union of: Record Part
range: Class
  union of: Documento
  union of: Record Part
property chain axiom: has direct constituent proxy
property chain axiom: proxy for
comment: Connects a Record or Record Part to another Record or Record Part that is its direct constituent.
label: a directement pour constituant @fr
label: tiene directamente como elemento constitutivo @es
change note: Fixed the property chain axiom.
  date: 2025-04-03
change note: Added a property chain axiom relating it to use of rico:Proxy.
  date: 2025-03-04
change note: Added a new rdfs:label in Spanish.
  date: 2023-11-27
change note: Updated the labels.
  date: 2023-11-12
change note: Added RecordPart to the domain.
  date: 2023-10-26
change note:
  date: 2023-09-08
  value: Object property added, along with its inverse property, in order to enable to express current, direct, partitive relations between records and other records or record parts (the possibly indirect, transitive relation, superproperty of this one, being also added).

has direct constituent proxy
type: ObjectProperty
sub property of: has constituent proxy
sub property of: has direct part
inverse of: proxy is direct constituent of
domain: Class
  union of: Documento
  union of: Record Part
range: Proxy
comment: Inverse of 'proxy is direct constituent of' object property.
label: a pour constituant direct le proxy @fr
label: tiene como directo elemento constitutivo el proxy @es
change note: Added the French and Spanish labels.
  date: 2025-04-02
change note: Introduced in RiC-O 1.1.
  date: 2025-03-04

has direct part
type: ObjectProperty
sub property of: has part transitive
inverse of: is direct part of
domain: Thing
range: Thing
comment: Connects a Thing to a Thing that is a direct constitutive or component part of that Thing.
label: a directement pour partie @fr
label: tiene directamente como parte @es
change note: Added a new rdfs:label in Spanish.
  date: 2023-11-27
change note: Updated the labels.
  date: 2023-11-12
change note:
  date: 2023-07-12
  value: Object property added, along with its inverse property, in order to enable to express current, direct, partitive relations between things (the possibly indirect, transitive relation, superproperty of this one, being also added).
scope note: To be used only when the current partitive relation is direct, without any intermediate node between the related things.

has direct subdivision
type: ObjectProperty
sub property of: has direct part
sub property of: has direct subordinate
sub property of: has subdivision transitive
inverse of: is direct subdivision of
domain: Group
range: Group
comment: Connects a Group to one of its direct subdivisions.
label: a directement pour subdivision @fr
label: tiene directamente como subdivisión @es
change note: Added a new rdfs:label in Spanish.
  date: 2023-11-27
change note: Updated the labels.
  date: 2023-11-12
change note:
  date: 2023-09-08
  value: Object property added, along with its inverse property, in order to enable to express current, direct, partitive relations between groups (the possibly indirect, transitive relation, superproperty of this one, being also added).

has direct subevent
type: ObjectProperty
sub property of: has direct part
sub property of: has subevent transitive
inverse of: is direct subevent of
domain: Event
range: Event
comment: Connects an ongoing Event to one of a series of Events that directly constitute that broader, ongoing Event.
label: est directement constitué de l’événement @fr
label: tiene directamente como parte de evento @es
change note: Added a new rdfs:label in Spanish.
  date: 2023-11-27
change note: Updated the labels.
  date: 2023-11-12
change note:
  date: 2023-09-08
  value: Object property added, along with its inverse property, in order to enable to express current, direct, partitive relations between ongoing events (the possibly indirect, transitive relation, superproperty of this one, being also added).

has direct subordinate
type: ObjectProperty
sub property of: has subordinate transitive
inverse of: is direct subordinate to
domain: Agent
range: Agent
comment: Connects an Agent to an Agent that is its direct subordinate.
label: a directement pour subalterne @fr
label: tiene directamente como subordinado o subordinada a @es
change note: Added a new rdfs:label in Spanish.
  date: 2023-11-27
change note: Updated the labels.
  date: 2023-11-12
change note:
  date: 2023-09-08
  value: Object property added, along with its inverse property, in order to enable to express current, direct, subordination relations between agents (the possibly indirect, transitive relation, superproperty of this one, being also added).

has documentary form type
type: ObjectProperty
sub property of: has or had type
inverse of: is documentary form type of
domain: Class
  union of: Documento
  union of: Record Part
range: Documentary Form Type
comment: Connects a Record or Record Part to its Documentary Form Type.
label: a pour type d’objet informationnel @fr
label: tiene como tipo documental @es
change note: Fixed a typo in the French label.
  date: 2023-12-30
change note: Added a new rdfs:label in Spanish.
  date: 2023-11-02
change note: Added a new rdfs:label in French.
  date: 2023-08-28
change note: changed the superproperty IRI.
  date: 2021-01-22

has draft
type: ObjectProperty
sub property of: follows in time
sub property of: has genetic link to record resource
inverse of: is draft of
domain: Class
  union of: Documento
  union of: Record Part
range: Class
  union of: Documento
  union of: Record Part
comment: Inverse of 'is draft of' object property.
label: a pour ébauche @fr
label: tiene como borrador @es
change note: Added a new rdfs:label in Spanish.
  date: 2023-11-02
change note: Added a new rdfs:label in French.
  date: 2023-08-28
RiC-CM corresponding component: RiC-011i ('has draft' relation)

has end date
type: ObjectProperty
sub property of: is associated with date
inverse of: is end date of
domain: Thing
range: Date
comment: Inverse of 'is end date of' object property.
label: a pour date de fin @fr
label: tiene como fecha final @es
change note: Added a new rdfs:label in Spanish.
  date: 2023-11-02
change note: Added a new rdfs:label in French.
  date: 2023-08-28
RiC-CM corresponding component: RiC-R071i ('has end date' relation)

has event type
type: ObjectProperty
sub property of: has or had type
inverse of: is event type of
domain: Event
range: Event Type
comment: Connects an Event to an Event Type which categorizes it.
label: a pour type d’événement @fr
label: tiene como tipo de evento @es
change note: Added a new rdfs:label in Spanish.
  date: 2023-11-02
change note: Added a new rdfs:label in French.
  date: 2023-08-28
change note: changed the superproperty IRI.
  date: 2021-01-22

has extent
type: ObjectProperty
sub property of: is related to
inverse of: is extent of
domain: Thing
range: Extent
comment: Connects a Record Resource or Instantiation to an Extent
label: a pour mesure @fr
label: tiene como extensión @es
change note: Added a new rdfs:label in Spanish.
  date: 2023-11-02
change note: Added a new rdfs:label in French; added an xml:lang attribute to the rdfs:comment.
  date: 2023-08-28
change note: Changed the domain (was Instantiation or RecordResource) to Thing; changed the definition accordingly.
  date: 2023-08-28
change note: Object property created along with the Extent class and its subclasses, in order to provide methods for handling extent accurately.
  date: 2020-10-28

has extent type
type: ObjectProperty
sub property of: has or had type
inverse of: is extent type of
domain: Extent
range: Extent Type
comment: Connects an Extent to an Extent Type that categorizes what is being measured.
label: a pour type de mesure @fr
label: tiene como tipo de extensión @es
change note: Added a new rdfs:label in Spanish.
  date: 2023-11-02
change note: Added a new rdfs:label in French; added an xml:lang attribute to the rdfs:comment.
  date: 2023-08-28
change note: Object property added along with the Extent Type class.
  date: 2020-11-01

has family association with
type: ObjectProperty
sub property of: is agent associated with agent
type: SymmetricProperty
domain: Person
range: Person
property chain axiom: thing is connected to relation
property chain axiom: has the role of the Family Relation
property chain axiom: relation connects
comment: Connects two Persons that have some type of family link, i.e. belong to the same family. This relation is symmetric.
label: a une relation familiale avec @fr
label: tiene asociación familiar con @es
change note: Aligned with RiC-CM 1.0: updated the skos:scopeNote.
  date: 2023-11-12
change note: In order to get a system of rolified Relation classes: modified the property chain axiom so that it now involves the new familyRelation_role object property.
  date: 2023-11-08
change note: Added a new rdfs:label in Spanish.
  date: 2023-11-02
change note: Added a new rdfs:label in French.
  date: 2023-08-28
change note: changed the IRI, label, textual definition (changed made in order to make RiC-O compliant with RiC-CM 0.2; the name of this property in RiC-O 0.1 was "hasFamilyLinkWith").
  date: 2021-01-22
scope note: Use hasOrHadMember for connecting a Family and a Person.
RiC-CM corresponding component: RiC-R047 ('has family association with' relation)

has family type
type: ObjectProperty
sub property of: has or had type
inverse of: is family type of
domain: Family
range: Family Type
comment: Connects a Family to a Family Type that categorizes it.
label: a pour type de famille @fr
label: tiene como tipo de familia @es
change note: Added a new rdfs:label in Spanish.
  date: 2023-11-02
change note: Added a new rdfs:label in French.
  date: 2023-08-28
change note: changed the superproperty IRI.
  date: 2021-01-22

has genetic link to record resource
type: ObjectProperty
sub property of: is record resource associated with record resource
type: SymmetricProperty
domain: Record Resource
range: Record Resource
property chain axiom: thing is connected to relation
property chain axiom: has the role of the Record Resource Genetic Relation
property chain axiom: relation connects
comment: Connects two Record Resources when there is a genetic link between them. Genetic in this sense is as defined by diplomatics, i.e. the process by which a Record Resource is developed. This relation is symmetric.
label: a une relation génétique avec la ressource archivistique @fr
label: tiene vínculo de origen con recurso documental @es
change note: Aligned with RiC-CM 1.0: updated the skos:scopeNote.
  date: 2023-11-12
change note: In order to get a system of rolified Relation classes: modified the property chain axiom so that it now involves the new recordResourceGeneticRelation_role object property.
  date: 2023-11-08
change note: Added the property chain axiom so that this property is formally defined as a shortcut.
  date: 2023-11-07
change note: Added a new rdfs:label in Spanish.
  date: 2023-11-02
change note: Added a new rdfs:label in French.
  date: 2023-08-28
scope note: Use to connect two Record Resources only if it is not possible to use a narrower, more specific, asymmetric Record Resource to Record Resource relation, for example is original of.
RiC-CM corresponding component: RiC-R023 ('has genetic link to record resource' relation)

has identifier type
type: ObjectProperty
sub property of: has or had type
inverse of: is identifier type of
domain: Identifier
range: Identifier Type
comment: Connects an Identifier and an Identifier Type that categorizes it.
label: a pour type d’identifiant @fr
label: tiene como tipo de identificador @es
change note: Added a new rdfs:label in Spanish.
  date: 2023-11-02
change note: Added a new rdfs:label in French.
  date: 2023-08-28
change note: changed the superproperty IRI.
  date: 2021-01-22
change note: Object property added along with IdentifierType class and isIdentifierTypeOf object property.
  date: 2020-10-19

has migration date
type: ObjectProperty
sub property of: has derivation date
inverse of: is migration date of
domain: Instantiation
range: Date
property chain axiom: thing is source of relation
property chain axiom: has the role of the Migration Relation
property chain axiom: relation has date
comment: Inverse of 'is migration date of' object property.
label: a pour date de migration @fr
label: tiene como fecha de migración @es
change note: Added the property chain axiom.
  date: 2025-03-13
change note: Made this property a subproperty of the new 'hasDerivationDate' property.
  date: 2025-03-01
change note: Added in RiC-O 1.1.
  date: 2025-02-19

has modification date
type: ObjectProperty
sub property of: is associated with date
inverse of: is modification date of
domain: Thing
range: Date
comment: Inverse of 'is modification date of' object property.
label: a pour date de modification @fr
label: tiene como fecha de modificación @es
change note: Added a new rdfs:label in Spanish.
  date: 2023-11-02
change note: Added a new rdfs:label in French.
  date: 2023-08-28
RiC-CM corresponding component: RiC-R073i ('has modification date' relation)

has or had agent name
type: ObjectProperty
sub property of: has or had name
inverse of: is or was agent name of
domain: Agent
range: Agent Name
comment: Connects an Agent and (one of) its present or past Agent Name.
label: a ou a eu pour nom d’agent @fr
label: tiene o tenía como nombre de agente @es
change note: Added a new rdfs:label in Spanish.
  date: 2023-11-02
change note: Added a new rdfs:label in French.
  date: 2023-08-28
change note: changed the IRI, label, inverse property IRI, textual definition (the name of this property in RiC-O 0.1 was "hasAgentName").
  date: 2021-01-22

has or had all members with accumulation date
type: ObjectProperty
sub property of: is associated with date
inverse of: is or was accumulation date of all members of
domain: Record Set
range: Date
comment: Inverse of 'is or was accumulation date of all members of' object property.
label: inclut ou a inclus des membres ayant tous pour date d'accumulation @fr
label: incluye o incluía miembros, todos como fecha de acumulación @es
change note: Adjusted the Spanish label.
  date: 2025-04-06
change note: Added in RiC-O 1.1.
  date: 2024-10-04

has or had all members with content type
type: ObjectProperty
sub property of: has or had all members with type
inverse of: is or was content type of all members of
domain: Record Set
range: Content Type
comment: Connects a Record Set and a Content Type that categorizes all the Records or Record Parts that are or were included in the Record Set.
label: inclut ou a inclus des membres ayant tous pour type de contenu @fr
label: incluye o incluía miembros, todos con tipo de contenido @es
change note: Adjusted the Spanish label.
  date: 2025-04-06
change note: Added a new rdfs:label in Spanish.
  date: 2023-11-02
change note: Added a new rdfs:label in French.
  date: 2023-08-28
change note:
  date: 2020-12-28
  value: Object property added for handling the case where a Record Set is described as having all or some members that belong to some category (see RiC-CM 0.2 attributes section, #4.4 on Record Set, Record and Record Part attributes).

has or had all members with creation date
type: ObjectProperty
sub property of: has beginning date
inverse of: is or was creation date of all members of
domain: Record Set
range: Date
comment: Inverse of 'is or was creation date of all members of' object property.
label: inclut ou a inclus des membres ayant tous pour date de création @fr
label: incluye o incluía miembros, todos con fecha de creación @es
change note: Adjusted the Spanish label.
  date: 2025-04-06
change note: Added a new rdfs:label in Spanish.
  date: 2023-11-27
change note: Renamed the property in order to take the past members of the record set into account. Adjusted the annotations accordingly.
  date: 2023-10-13
change note: Added the French label
  date: 2023-10-12
change note: Added in RiC-O 1.0.
  date: 2023-09-22
RiC-CM corresponding component: RiC-R081i ('has or had all members with creation date' relation)

has or had all members with documentary form type
type: ObjectProperty
sub property of: has or had all members with type
inverse of: is or was documentary form type of all members of
domain: Record Set
range: Documentary Form Type
comment: Connects a Record Set and a Documentary Form Type that categorizes all the Records or Record Parts that are or were included in the Record Set.
label: inclut ou a inclus des membres ayant tous pour type @fr
label: incluye o incluía miembros, todos con tipo documental @es
change note: Adjusted the Spanish label.
  date: 2025-04-06
change note: Added a new rdfs:label in Spanish.
  date: 2023-11-02
change note: Added a new rdfs:label in French.
  date: 2023-08-28
change note:
  date: 2020-12-28
  value: Object property added for handling the case where a Record Set is described as having all or some members that belong to some category (see RiC-CM 0.2 attributes section, #4.4 on Record Set, Record and Record Part attributes).

has or had all members with language
type: ObjectProperty
sub property of: is related to
inverse of: is or was language of all members of
domain: Record Set
range: Language
comment: Connects a Record Set and a Language used by all the Records or Record Parts that are or were included in the Record Set.
label: inclut ou a inclus des membres ayant tous pour langue @fr
label: incluye o incluía miembros, todos con lengua @es
change note: Adjusted the Spanish label.
  date: 2025-04-06
change note: Added a new rdfs:label in Spanish.
  date: 2023-11-02
change note: Added a new rdfs:label in French.
  date: 2023-08-28
change note:
  date: 2020-12-28
  value: Object property added for handling the case where a Record Set is described as having all or some members that belong to some category (see RiC-CM 0.2 attributes section, #4.4 on Record Set, Record and Record Part attributes).

has or had all members with legal status
type: ObjectProperty
sub property of: has or had all members with type
inverse of: is or was legal status of all members of
domain: Record Set
range: Legal Status
comment: Connects a Record Set and a Legal Status that categorizes all the Records or Record Parts that are or were included in the Record Set.
label: inclut ou a inclus des membres ayant tous pour statut légal @fr
label: incluye o incluía miembros, todos con status jurídico @es
change note: Adjusted the Spanish label.
  date: 2025-04-06
change note: Added a new rdfs:label in Spanish.
  date: 2023-11-02
change note: Added a new rdfs:label in French.
  date: 2023-08-28
change note:
  date: 2020-12-28
  value: Object property added for handling the case where a Record Set is described as having all or some members that belong to some category (see RiC-CM 0.2 attributes section, #4.4 on Record Set, Record and Record Part attributes).

has or had all members with main subject
type: ObjectProperty
sub property of: has or had all members with subject
sub property of: has or had main subject
inverse of: is or was main subject of all members of
domain: Record Set
range: Thing
comment: Connects a Record Set and a Thing that is the main subject of all the Records or Record Parts that are or were included in the Record Set.
label: inclut ou a inclus des membres ayant tous pour principal sujet @fr
label: incluye o incluía miembros, todos con matería principal @es
change note: Introduced in RiC-O 1.1.
  date: 2025-04-05

has or had all members with record state
type: ObjectProperty
sub property of: has or had all members with type
inverse of: is or was record state of all members of
domain: Record Set
range: Record State
comment: Connects a Record Set and a Record State that categorizes all the Records or Record Parts that are or were included in the Record Set.
label: inclut ou a inclus des membres ayant tous pour état @fr
label: incluye o incluía miembros, todos con estado de documento @es
change note: Adjusted the Spanish label.
  date: 2025-04-06
change note: Added a new rdfs:label in Spanish.
  date: 2023-11-02
change note: Added a new rdfs:label in French.
  date: 2023-08-28
change note:
  date: 2020-12-28
  value: Object property added for handling the case where a Record Set is described as having all or some members that belong to some category (see RiC-CM 0.2 attributes section, #4.4 on Record Set, Record and Record Part attributes).

has or had all members with subject
type: ObjectProperty
sub property of: has or had subject
inverse of: is or was subject of all members of
domain: Record Set
range: Thing
comment: Connects a Record Set and a Thing that is the subject of all the Records or Record Parts that are or were included in the Record Set.
label: inclut ou a inclus des membres ayant tous pour sujet @fr
label: incluye o incluía miembros, todos con matería @es
change note: Introduced in RiC-O 1.1.
  date: 2025-04-05

has or had all members with type
type: ObjectProperty
sub property of: is related to
inverse of: is or was type of all members of
domain: Record Set
range: Type
comment: Connects a Record Set and a Type to which all the Records or Record Parts that are or were included in the Record Set belong.
label: inclut ou a inclus des membres ayant tous pour type @fr
label: incluye o incluía miembros, todos con tipo @es
change note: Adjusted the Spanish label.
  date: 2025-04-06
change note: Changed the word 'category' into 'type' in all applicable properties names.
  date: 2024-10-04
change note: Added a new rdfs:label in Spanish.
  date: 2023-11-02
change note: Added a new rdfs:label in French.
  date: 2023-08-28
change note:
  date: 2020-12-28
  value: Object property added for handling the case where a Record Set is described as having all or some members that belong to some category (see RiC-CM 0.2 attributes section, #4.4 on Record Set, Record and Record Part attributes).

has or had analogue instantiation
type: ObjectProperty
sub property of: has or had instantiation
inverse of: is or was analogue instantiation of
domain: Record Resource
range: Instantiation
comment: Connects a record resource to one of its analogue instantiations, whether it exists or has been lost or destroyed.
label: a ou a eu pour instanciation analogique @fr
label: tiene o tenía como instanciación analogica @es
change note: Added a new rdfs:label in Spanish.
  date: 2023-11-27
change note: Added the property.
  date: 2023-08-29
scope note: In some situations, it may be useful or necessary to connect a record resource to an analogue instantiation that no longer exists or has been lost.

has or had appellation
type: ObjectProperty
sub property of: is related to
inverse of: is or was appellation of
domain: Thing
range: Appellation
property chain axiom: thing is target of relation
property chain axiom: has the role of the Appellation Relation
property chain axiom: relation has source
comment: Connects a Thing to an Appellation that is or was used for designating it.
label: a ou a eu pour appellation @fr
label: tiene o tenía como denominación @es
change note: In order to get a system of rolified Relation classes: modified the property chain axiom so that it now involves the new appellationRelation_role object property.
  date: 2023-11-08
change note: Added a new rdfs:label in Spanish.
  date: 2023-11-02
change note: Added a new rdfs:label in French.
  date: 2023-08-28
change note: changed the IRI, label, inverse property IRI, textual definition (the name of this property in RiC-O 0.1 was "hasAppellation").
  date: 2021-01-22

has or had authority over
type: ObjectProperty
sub property of: is related to
inverse of: is or was under authority of
domain: Agent
range: Thing
property chain axiom: thing is source of relation
property chain axiom: has the role of the Authority Relation
property chain axiom: relation has target
comment: Connects an Agent to a Thing over which the Agent has or had some kind of authority.
label: a ou a eu autorité sur @fr
label: tiene o tenía control sobre @es
change note: Aligned with RiC-CM 1.0: updated the description (rdfs:comment), skos:scopeNote.
  date: 2023-11-12
change note: In order to get a system of rolified Relation classes: modified the property chain axiom so that it now involves the new authorityRelation_role object property.
  date: 2023-11-08
change note: Added a new rdfs:label in Spanish.
  date: 2023-11-02
change note: Added a new rdfs:label in French.
  date: 2023-08-28
change note: changed the IRI, label, inverse property IRI, textual definition (changed made in order to make RiC-O compliant with RiC-CM 0.2; the name of this property in RiC-O 0.1 was "hasAuthorityOver").
  date: 2021-01-22
scope note: Use only if it is not possible to specify a narrower authority relation, for example is or was owner of.
RiC-CM corresponding component: RiC-R036 ('has or had authority over' relation)

has or had component
type: ObjectProperty
sub property of: has or had part
sub property of: is instantiation associated with instantiation
inverse of: is or was component of
domain: Instantiation
range: Instantiation
comment: Connects an Instantiation to one of its present or past component instantiations.
label: a ou a eu pour composant @fr
label: tiene o tenía como componente @es
change note: Added a new rdfs:label in Spanish.
  date: 2023-11-02
change note: Added a new rdfs:label in French.
  date: 2023-08-28
change note: changed the IRI, label, inverse property IRI, textual definition (changed made in order to make RiC-O compliant with RiC-CM 0.2; the name of this property in RiC-O 0.1 was "hasComponent").
  date: 2021-01-22
RiC-CM corresponding component: RiC-R004 ('has or had component' relation)

has or had constituent
type: ObjectProperty
sub property of: has or had part
sub property of: is record resource associated with record resource
inverse of: is or was constituent of
domain: Class
  union of: Documento
  union of: Record Part
range: Class
  union of: Documento
  union of: Record Part
comment: Connects a Record or Record Part to a Record or Record part that is or was a constituent of that Record or Record Part.
label: a ou a eu pour constituant @fr
label: tiene o tenía como elemento constitutivo @es
change note: Aligned with RiC-CM 1.0: updated the description (rdfs:comment).
  date: 2023-11-12
change note: Added a new rdfs:label in Spanish.
  date: 2023-11-02
change note: Added Record Part to the domain.
  date: 2023-10-19
change note: Added a new rdfs:label in French.
  date: 2023-08-28
change note: changed the IRI, label, inverse property IRI, textual definition (changed made in order to make RiC-O compliant with RiC-CM 0.2; the name of this property in RiC-O 0.1 was "hasConstituent").
  date: 2021-01-22
RiC-CM corresponding component: RiC-R003 ('has or had constituent' relation)

has or had controller
type: ObjectProperty
sub property of: is or was subordinate to
sub property of: is or was under authority of
inverse of: is or was controller of
domain: Agent
range: Agent
property chain axiom: thing is target of relation
property chain axiom: has the role of the Agent Control Relation
property chain axiom: relation has source
comment: Inverse of 'is or was controller of' object property.
label: est ou a été contrôlé par @fr
label: tiene o tenía como controlador @es
change note: Fixed the French label.
  date: 2024-09-02
change note: In order to get a system of rolified Relation classes: modified the property chain axiom so that it now involves the new agentControlRelation_role object property.
  date: 2023-11-08
change note: Added a new rdfs:label in Spanish.
  date: 2023-11-02
change note: Added a new rdfs:label in French.
  date: 2023-08-28
change note:
  date: 2021-01-22
  value: changed the IRI, label, inverse property IRI, text definition, corresponding CM component name (changed made in order to make RiC-O compliant with RiC-CM 0.2; the name of this property in RiC-O 0.1 was "controlledBy").
RiC-CM corresponding component: RiC-R041i ('has or had controller' relation)

has or had coordinates
type: ObjectProperty
sub property of: is related to
inverse of: is or was coordinates of
domain: Physical Location
range: Coordinates
comment: Connects a Physical Location to its past or present coordinates in a reference system.
label: a ou a eu pour coordonnées @fr
label: tiene como coordenadas de lugar @es
change note: Added a new rdfs:label in Spanish.
  date: 2023-11-02
change note: fixed the English label (added the past tense.)
  date: 2023-08-29
change note: Added a new rdfs:label in French.
  date: 2023-08-28
change note: changed the IRI, label, inverse property IRI, textual definition (the name of this property in RiC-O 0.1 was "hasCoordinates").
  date: 2021-01-22

has or had corporate body type
type: ObjectProperty
sub property of: has or had type
inverse of: is or was corporate body type of
domain: Corporate Body
range: Corporate Body Type
comment: Connects a Corporate Body to a Corporate Body Type which categorizes or categorized it.
label: a ou a eu pour type de collectivité @fr
label: tiene o tenía como tipo de institucion @es
change note: Added a new rdfs:label in Spanish.
  date: 2023-11-02
change note: Added a new rdfs:label in French.
  date: 2023-08-28
change note: changed the IRI, label, inverse property IRI, textual definition (the name of this property in RiC-O 0.1 was "hasCorporateBodyType").
  date: 2021-01-22

has or had correspondent
type: ObjectProperty
sub property of: knows
type: SymmetricProperty
domain: Person
range: Person
property chain axiom: thing is connected to relation
property chain axiom: has the role of the Correspondence Relation
property chain axiom: relation connects
comment: Connects two Persons that correspond or have corresponded with each other. This relation is symmetric.
label: a ou a eu pour correspondant @fr
label: tiene o tenía como correspondiente @es
change note: In order to get a system of rolified Relation classes: modified the property chain axiom so that it now involves the new correspondenceRelation_role object property.
  date: 2023-11-08
change note: Added a new rdfs:label in Spanish.
  date: 2023-11-02
change note: Added a new rdfs:label in French.
  date: 2023-08-28
change note: changed the IRI, label, textual definition (changed made in order to make RiC-O compliant with RiC-CM 0.2; the name of this property in RiC-O 0.1 was "hasCorrespondent").
  date: 2021-01-22
RiC-CM corresponding component: RiC-R052 ('has or had correspondent' relation)

has or had demographic group
type: ObjectProperty
sub property of: has or had type
inverse of: is or was demographic group of
domain: Class
  union of: Group
  union of: Person
range: Demographic Group
comment: Connects a Person or a Group to a Demographic Group to which it belongs or belonged.
label: a ou a eu pour groupe démographique @fr
label: tiene o tenía como grupo demográfico @es
change note: Changed the French and Spanish labels (replaced 'catégorie' and 'categoria' with 'groupe' and 'grupo').
  date: 2024-10-10
change note: Added a new rdfs:label in Spanish.
  date: 2023-11-02
change note: Added a new rdfs:label in French.
  date: 2023-08-28
change note: changed the IRI, label, inverse property IRI, text definition, domain (the name of this property in RiC-O 0.1 was "belongsToDemographicGroup").
  date: 2021-01-22

has or had derived instantiation
type: ObjectProperty
sub property of: is instantiation associated with instantiation
sub property of: precedes in time
inverse of: is or was derived from instantiation
domain: Instantiation
range: Instantiation
property chain axiom: thing is source of relation
property chain axiom: has the role of the Derivation Relation
property chain axiom: relation has target
comment: Connects an instantiation to an instantiation that is derived from it, whether it exists or has been lost or destroyed.
label: a ou a eu pour instanciation dérivée @fr
label: tiene o tenía como instanciación derivada @es
change note: Added a new rdfs:label in Spanish.
  date: 2023-11-27
change note: In order to get a system of rolified Relation classes: modified the property chain axiom so that it now involves the new derivationRelation_role object property.
  date: 2023-11-08
change note:
  date: 2023-08-29
  value: Updated the IRI, inverse property, definition, labels and RiCMCorrespondingComponent, and added a skos:scopeNote; this in order to make the specification compliant with RiC-CM 1.0. The name of the property in RiC-O 0.2 was 'has derived instantiation'.
change note: Added a new rdfs:label in French.
  date: 2023-08-28
scope note: In some situations, it may be useful or necessary to connect an instantiation to an instantiation that was derived from it but no longer exists or or has been lost.
RiC-CM corresponding component: RiC-R014 ('has or had derived instantiation' relation)

has or had digital instantiation
type: ObjectProperty
sub property of: has or had instantiation
inverse of: is or was digital instantiation of
domain: Record Resource
range: Instantiation
comment: Connects a record resource to one of its digital instantiations, whether it exists or has been lost or destroyed.
label: a ou a eu pour instanciation numérique @fr
label: tiene o tenía como instanciación digital @es
change note: Added a new rdfs:label in Spanish.
  date: 2023-11-27
change note: Added the property.
  date: 2023-08-29
scope note: This property can be used, among other cases, when you want to convert findings aids encoded in EAD/XML and need a simple and accurate migration path to process dao or daogrp EAD elements. Also, in some situations, it may be useful or necessary to connect a record resource to a digital instantiation that no longer exists or or has been lost.

has or had employer
type: ObjectProperty
sub property of: has or had controller
inverse of: is or was employer of
domain: Person
range: Class
  union of: Corporate Body
  union of: Person
comment: Inverse of 'is or was employer of' object property.
label: a ou a eu pour employeur @fr
label: tiene o tenía como empleador @es
change note: Added a new rdfs:label in Spanish.
  date: 2023-11-27
change note: Changed the domain and range of the property. Added a rdfs:comment. Removed the isOrWasMemberOf super-property.
  date: 2023-10-26
change note: Added for RiC-O 1.0.
  date: 2023-10-19
change note: Fixed the lang of the French label.
  date: 2023-10-13

has or had holder
type: ObjectProperty
sub property of: has or had manager
inverse of: is or was holder of
domain: Class
  union of: Instantiation
  union of: Record Resource
range: Agent
property chain axiom: thing is target of relation
property chain axiom: has the role of the Record Resource Holding Relation
property chain axiom: relation has source
comment: Inverse of 'is or was holder of' object property.
label: est ou a été détenu par @fr
label: tiene o tenía como conservador a @es
change note: In order to get a system of rolified Relation classes: modified the property chain axiom so that it now involves the new recordResourceHoldingRelation_role object property.
  date: 2023-11-08
change note: Added a new rdfs:label in Spanish.
  date: 2023-11-02
change note: Added a new rdfs:label in French.
  date: 2023-08-28
change note: changed the IRI, label, inverse property IRI, text definition, super property IRI (changed made in order to make RiC-O compliant with RiC-CM 0.2; the name of this property in RiC-O 0.1 was "heldBy").
  date: 2021-01-22
RiC-CM corresponding component: RiC-R039i ('has or had holder' relation)

has or had identifier
type: ObjectProperty
sub property of: has or had appellation
inverse of: is or was identifier of
domain: Thing
range: Identifier
comment: Connects a Thing to one of its past or present Identifiers.
label: a ou a eu pour identifiant @fr
label: tiene o tenía como identificador @es
change note: Added a new rdfs:label in Spanish.
  date: 2023-11-02
change note: Added a new rdfs:label in French.
  date: 2023-08-28
change note: changed the IRI, label, inverse property IRI, text definition, super property IRI (the name of this property in RiC-O 0.1 was "identifiedBy").
  date: 2021-01-22

has or had instantiation
type: ObjectProperty
sub property of: is related to
inverse of: is or was instantiation of
domain: Record Resource
range: Instantiation
property chain axiom: thing is source of relation
property chain axiom: has the role of the Record Resource to Instantiation Relation
property chain axiom: relation has target
comment: Connects a Record Resource to an Instantiation, which either may exist or may have been lost or destroyed.
label: a ou a eu pour instanciation @fr
label: tiene o tenía como instanciación @es
change note: Added a new rdfs:label in Spanish.
  date: 2023-11-27
change note: Aligned with RiC-CM 1.0: updated the description (rdfs:comment).
  date: 2023-11-12
change note: In order to get a system of rolified Relation classes: modified the property chain axiom so that it now involves the new recordResourceToInstantiationRelation_role object property.
  date: 2023-11-08
change note:
  date: 2023-08-29
  value: Updated the IRI, inverse property, definition, labels and RiCMCorrespondingComponent, and added a skos:scopeNote; this in order to make the specification compliant with RiC-CM 1.0. The name of the property in RiC-O 0.2 was 'has instantiation'.
change note: Added a new rdfs:label in French.
  date: 2023-08-28
change note: changed the inverse property IRI.
  date: 2021-01-22
scope note: In some situations, it may be useful or necessary to connect a record resource to an instantiation that no longer exists or or has been lost, when some of its characteristics are known from some source, like an old finding aid.
RiC-CM corresponding component: RiC-R025 ('has or had instantiation' relation)

has or had intellectual property rights holder
type: ObjectProperty
sub property of: is or was under authority of
inverse of: is or was holder of intellectual property rights of
domain: Class
  union of: Instantiation
  union of: Record Resource
range: Class
  union of: Group
  union of: Person
  union of: Position
property chain axiom: thing is target of relation
property chain axiom: has the role of the Intellectual Property Rights Relation
property chain axiom: relation has source
comment: Inverse of 'is or was holder of intellectual property rights of' object property.
label: a ou a eu comme détenteur des droits de propriété intellectuelle @fr
label: tiene o tenía como titular de derechos de propiedad intelectual a @es
change note: Fixed the French label.
  date: 2024-09-02
change note: In order to get a system of rolified Relation classes: modified the property chain axiom so that it now involves the new intellectualPropertyRightsRelation_role object property.
  date: 2023-11-08
change note: Added a new rdfs:label in Spanish.
  date: 2023-11-02
change note: Added a new rdfs:label in French.
  date: 2023-08-28
change note:
  date: 2021-01-22
  value: changed the IRI, label, inverse property IRI, textual definition (changed made in order to make RiC-O compliant with RiC-CM 0.2; the name of this property in RiC-O 0.1 was "intellectualPropertyRightsHeldBy").
RiC-CM corresponding component: RiC-R040i ('has or had intellectual property rights holder ' relation)

has or had jurisdiction
type: ObjectProperty
sub property of: is agent associated with place
inverse of: is or was jurisdiction of
domain: Agent
range: Place
comment: Inverse of 'is or was jurisdiction of' object property.
label: a ou a eu pour ressort @fr
label: tiene o tenía como jurisdicción @es
change note: Added a new rdfs:label in Spanish.
  date: 2023-11-02
change note: Made subproperty of new property isAgentAssociatedWithPlace instead of its parent isAssociatedWithPlace.
  date: 2023-10-19
change note: Added a new rdfs:label in French.
  date: 2023-08-28
change note: changed the IRI, label, inverse property IRI and textual definition (changed made in order to make RiC-O compliant with RiC-CM 0.2; the name of this property in RiC-O 0.1 was "hasJurisdiction").
  date: 2021-01-22
RiC-CM corresponding component: RiC-R076i ('has or had jurisdiction' relation)

has or had language
type: ObjectProperty
sub property of: is related to
inverse of: is or was language of
domain: Class
  union of: Agent
  union of: Documento
  union of: Record Part
range: Language
comment: Connects an Agent, Record or Record Part to a Language that uses or used it.
label: a ou a eu pour langue @fr
label: tiene o tenía como lengua @es
change note: Added a new rdfs:label in Spanish.
  date: 2023-11-02
change note: Added a new rdfs:label in French.
  date: 2023-08-28
change note: changed the definition to be consistent with the inverse relation.
  date: 2023-07-25
change note: changed the IRI, label, inverse property IRI and textual definition (the name of this property in RiC-O 0.1 was "hasLanguage").
  date: 2021-01-22

has or had leader
type: ObjectProperty
sub property of: has or had controller
inverse of: is or was leader of
domain: Group
range: Person
property chain axiom: thing is target of relation
property chain axiom: has the role of the Leadership Relation
property chain axiom: relation has source
comment: Inverse of 'is or was leader of' object property.
label: a ou a eu pour dirigeant @fr
label: tiene o tenía como líder a @es
change note: In order to get a system of rolified Relation classes: modified the property chain axiom so that it now involves the new leadershipRelation_role object property.
  date: 2023-11-08
change note: Added a new rdfs:label in Spanish.
  date: 2023-11-02
change note: Added a new rdfs:label in French.
  date: 2023-08-28
change note: changed the IRI, label, inverse property IRI, text definition, super property IRI (changed made in order to make RiC-O compliant with RiC-CM 0.2; the name of this property in RiC-O 0.1 was "ledBy").
  date: 2021-01-22
RiC-CM corresponding component: RiC-R042i ('has or had leader' relation)

has or had legal status
type: ObjectProperty
sub property of: has or had type
inverse of: is or was legal status of
domain: Class
  union of: Agent
  union of: Documento
  union of: Record Part
range: Legal Status
comment: Connects an Agent or Record Resource to a Legal Status which categorized or categorizes it.
label: a ou a eu pour statut légal @fr
label: tiene o tenía como status jurídico @es
change note: Added a new rdfs:label in Spanish.
  date: 2023-11-02
change note: Added a new rdfs:label in French.
  date: 2023-08-28
change note: changed the IRI, label, inverse property IRI and textual definition (the name of this property in RiC-O 0.1 was "hasLegalStatus").
  date: 2021-01-22

has or had location
type: ObjectProperty
sub property of: is associated with place
inverse of: is or was location of
domain: Thing
range: Place
comment: Inverse of 'is or was location of' object property.
label: a ou a eu pour localisation @fr
label: tiene o tenía como localización @es
change note: Added a new rdfs:label in Spanish.
  date: 2023-11-02
change note: Added a new rdfs:label in French.
  date: 2023-08-28
change note: changed the IRI, label, inverse property IRI and textual definition (changed made in order to make RiC-O compliant with RiC-CM 0.2; the name of this property in RiC-O 0.1 was "hasLocation").
  date: 2021-01-22
RiC-CM corresponding component: RiC-R075i ('has or had location' relation)

has or had main subject
type: ObjectProperty
sub property of: has or had subject
inverse of: is or was main subject of
domain: Record Resource
range: Thing
comment: Connects a Record Resource to a Thing that is or was its main subject.
label: a ou a eu pour sujet principal @fr
label: tiene o tenía como matería principal @es
change note: Added a new rdfs:label in Spanish.
  date: 2023-11-02
change note: Added a new rdfs:label in French.
  date: 2023-08-28
change note: changed the IRI, label, inverse property IRI and textual definition (changed made in order to make RiC-O compliant with RiC-CM 0.2; the name of this property in RiC-O 0.1 was "hasMainSubject").
  date: 2021-01-22
scope note: Use for specifying, for example, that a Record Set of type personal file has main subject some person, which would help end users to retrieve the main archival resources about this person.
RiC-CM corresponding component: RiC-R020 ('has or had main subject' relation)

has or had manager
type: ObjectProperty
sub property of: is or was under authority of
inverse of: is or was manager of
domain: Class
  union of: Instantiation
  union of: Record Resource
range: Agent
property chain axiom: thing is target of relation
property chain axiom: has the role of the Management Relation
property chain axiom: relation has source
comment: Inverse of 'is or was manager of' object property.
label: a ou a eu pour gestionnaire @fr
label: tiene o tenía como gestor a @es
change note: In order to get a system of rolified Relation classes: modified the property chain axiom so that it now involves the new managementRelation_role object property.
  date: 2023-11-08
change note: Added a new rdfs:label in Spanish.
  date: 2023-11-02
change note: Added a new rdfs:label in French.
  date: 2023-08-28
change note:
  date: 2021-01-22
  value: changed the IRI, label, inverse property IRI, text definition, super property IRI (changed made in order to make RiC-O compliant with RiC-CM 0.2; the name of this property in RiC-O 0.1 was "managedBy").
RiC-CM corresponding component: RiC-R038i ('is or was managed by' relation)

has or had mandate type
type: ObjectProperty
sub property of: has or had rule type
inverse of: is or was mandate type of
domain: Mandate
range: Mandate Type
comment: Connects a Mandate to a Mandate Type that categorized or categorizes it.
label: a ou a eu pour type de mandat @fr
label: tiene o tenía como tipo de norma @es
change note: Added the property, and its inverse one, following the creation of the MandateType class, that corresponds to the new Mandate Type attribute in RiC-CM 1.0.
  date: 2023-11-13

has or had member
type: ObjectProperty
sub property of: is agent associated with agent
inverse of: is or was member of
domain: Group
range: Person
property chain axiom: thing is source of relation
property chain axiom: has the role of the Membership Relation
property chain axiom: relation has target
comment: Connects a Group to a Person that is or was a member of that Group.
label: a ou a eu pour membre @fr
label: tiene o tenía como miembro a @es
change note: In order to get a system of rolified Relation classes: modified the property chain axiom so that it now involves the new membershipRelation_role object property.
  date: 2023-11-08
change note: Added a new rdfs:label in Spanish.
  date: 2023-11-02
change note: Added a new rdfs:label in French.
  date: 2023-08-28
change note: changed the IRI, label, inverse property IRI and textual definition (changed made in order to make RiC-O compliant with RiC-CM 0.2; the name of this property in RiC-O 0.1 was "hasMember").
  date: 2021-01-22
RiC-CM corresponding component: RiC-R055 ('has or had member' relation)

has or had most members with accumulation date
type: ObjectProperty
sub property of: has or had some members with accumulation date
inverse of: is or was accumulation date of most members of
domain: Record Set
range: Date
comment: Inverse of 'is or was accumulation date of most members of' object property.
label: inclut ou a inclus des membres dont la plupart ont pour date d'accumulation @fr
label: incluye o incluía miembros, la mayoría de los cuales con fecha de acumulación @es
change note: Adjusted the Spanish label.
  date: 2025-04-06
change note: Added in RiC-O 1.1.
  date: 2024-10-04

has or had most members with creation date
type: ObjectProperty
sub property of: has or had some members with creation date
inverse of: is or was creation date of most members of
domain: Record Set
range: Date
comment: Inverse of 'is or was creation date of most members of' object property.
label: inclut ou a inclus des membres dont la plupart ont pour date de création @fr
label: incluye o incluía miembros, la mayoría de los cuales con fecha de creación @es
change note: Adjusted the Spanish label.
  date: 2025-04-06
change note: Added a new rdfs:label in Spanish.
  date: 2023-11-27
change note: Renamed the property in order to take the past members of the record set into account. Adjusted the annotations accordingly.
  date: 2023-10-13
change note: Added the French label
  date: 2023-10-12
change note: Made this property a subproperty of hasSomeMembersWithCreationDate.
  date: 2023-10-10
change note: Added in RiC-O 1.0.
  date: 2023-09-22
RiC-CM corresponding component: RiC-R083i ('has or had most members with creation date' relation)

has or had name
type: ObjectProperty
sub property of: has or had appellation
inverse of: is or was name of
domain: Thing
range: Name
comment: Connects a Thing to one of its past or present Names.
label: a ou a eu pour nom @fr
label: tiene o tenía como nombre @es
change note: Added a new rdfs:label in Spanish.
  date: 2023-11-02
change note: Added a new rdfs:label in French.
  date: 2023-08-28
change note: changed the IRI, label, inverse property IRI, textual definition, super property IRI (the name of this property in RiC-O 0.1 was "hasName").
  date: 2021-01-22

has or had occupation of type
type: ObjectProperty
sub property of: has or had demographic group
inverse of: is or was occupation type of
domain: Person
range: Occupation Type
comment: Connects a Person to an Occupation Type that categorized or categorizes his/her occupation (profession, trade or craft).
label: a ou a eu pour type d’occupation @fr
label: tiene o tenía como tipo de ocupación @es
change note: Added a new rdfs:label in Spanish.
  date: 2023-11-02
change note: Added a new rdfs:label in French.
  date: 2023-08-28
change note: changed the IRI, label, inverse property IRI, textual definition, super property IRI (the name of this property in RiC-O 0.1 was "hasOccupationOfType").
  date: 2021-01-22

has or had owner
type: ObjectProperty
sub property of: is or was under authority of
inverse of: is or was owner of
domain: Thing
range: Class
  union of: Group
  union of: Person
  union of: Position
property chain axiom: thing is target of relation
property chain axiom: has the role of the Ownership Relation
property chain axiom: relation has source
comment: Inverse of 'is or was owner of' object property.
label: a ou a eu pour propriétaire @fr
label: tiene o tenía como poseedor a @es
change note: In order to get a system of rolified Relation classes: modified the property chain axiom so that it now involves the new ownershipRelation_role object property.
  date: 2023-11-08
change note: Added a new rdfs:label in Spanish.
  date: 2023-11-02
change note: Added a new rdfs:label in French.
  date: 2023-08-28
change note: changed the IRI, label, inverse property IRI, text definition, super property IRI (changed made in order to make RiC-O compliant with RiC-CM 0.2; the name of this property in RiC-O 0.1 was "ownedBy").
  date: 2021-01-22
RiC-CM corresponding component: RiC-R037i ('has or had owner' relation)

has or had part
type: ObjectProperty
sub property of: is related to
inverse of: is or was part of
domain: Thing
range: Thing
property chain axiom: thing is source of relation
property chain axiom: has the role of the Whole Part Relation
property chain axiom: relation has target
comment: Connects a Thing to a constitutive or component part of that Thing.
label: a ou a eu pour partie @fr
label: tiene o tenía como parte @es
change note: Aligned with RiC-CM 1.0: updated the skos:scopeNote.
  date: 2023-11-12
change note: In order to get a system of rolified Relation classes: modified the property chain axiom so that it now involves the new wholePartRelation_role object property.
  date: 2023-11-08
change note: Added a new rdfs:label in Spanish.
  date: 2023-11-02
change note: Added a new rdfs:label in French.
  date: 2023-08-28
change note: changed the IRI, label, inverse property IRI, textual definition (changed made in order to make RiC-O compliant with RiC-CM 0.2; the name of this property in RiC-O 0.1 was "hasPart").
  date: 2021-01-22
scope note: Use to connect a Thing to another Thing that is or was a part of the whole Thing only if it is not possible to use a narrower, more specific whole/part relation, for example has or had constituent. The end of existence of a whole/part relation may affect the integrity or nature of the domain entity.
RiC-CM corresponding component: RiC-R002 ('has or had part' relation)

has or had participant
type: ObjectProperty
sub property of: is event associated with
inverse of: is or was participant in
domain: Event
range: Thing
comment: Connects an Event to a Thing that is or was actively or passively involved in it.
label: a ou a eu pour participant @fr
label: tiene o tenía como participante @es
change note: Added a new rdfs:label in Spanish.
  date: 2023-11-02
change note: Added a new rdfs:label in French.
  date: 2023-08-28
change note: changed the IRI, label, inverse property IRI, textual definition (changed made in order to make RiC-O compliant with RiC-CM 0.2; the name of this property in RiC-O 0.1 was "involves").
  date: 2021-01-22
RiC-CM corresponding component: RiC-R058 ('has or had participant' relation)

has or had physical location
type: ObjectProperty
sub property of: is place associated with
inverse of: is or was physical location of
domain: Place
range: Physical Location
comment: Connects a Place to one of its past or present Physical Location.
label: a ou a eu pour localisation physique @fr
label: tiene o tenía como localización física @es
change note: Added a new rdfs:label in Spanish.
  date: 2023-11-02
change note: Added a new rdfs:label in French.
  date: 2023-08-28
change note: Property made a subproperty of 'isPlaceAssociatedWith".
  date: 2021-02-01
change note: changed the IRI, label, inverse property IRI, textual definition (the name of this property in RiC-O 0.1 was "hasPhysicalLocation").
  date: 2021-01-22

has or had place name
type: ObjectProperty
sub property of: has or had name
inverse of: is or was place name of
domain: Place
range: Place Name
comment: Connects a Place to one of its past or present names.
label: a ou a eu pour nom de lieu @fr
label: tiene o tenía como nombre de lugar @es
change note: Added a new rdfs:label in Spanish.
  date: 2023-11-02
change note: Added a new rdfs:label in French.
  date: 2023-08-28
change note: changed the IRI, label, inverse property IRI, text definition, super property IRI (the name of this property in RiC-O 0.1 was "hasPlaceName").
  date: 2021-01-22

has or had place type
type: ObjectProperty
sub property of: has or had type
inverse of: is or was place type of
domain: Place
range: Place Type
comment: Connects a Place to a Place Type that categorized or categorizes it.
label: a ou a eu pour type de lieu @fr
label: tiene o tenía como tipo de lugar @es
change note: Added a new rdfs:label in Spanish.
  date: 2023-11-02
change note: Added a new rdfs:label in French.
  date: 2023-08-28
change note: changed the IRI, label, inverse property IRI, text definition, super property IRI (the name of this property in RiC-O 0.1 was "hasPlaceType").
  date: 2021-01-22

has or had position
type: ObjectProperty
sub property of: is agent associated with agent
inverse of: exists or existed in
domain: Group
range: Position
property chain axiom: thing is target of relation
property chain axiom: has the role of the Position to Group Relation
property chain axiom: relation has source
comment: Inverse of 'exists or existed in' object property.
label: occupe ou a occupé le poste @fr
label: tiene o tenía como puesto @es
change note: In order to get a system of rolified Relation classes: modified the property chain axiom so that it now involves the new positionToGroupRelation_role object property.
  date: 2023-11-08
change note: Added the property chain axiom so that this property is formally defined as a shortcut (the inverse property already was).
  date: 2023-11-07
change note: Added a new rdfs:label in Spanish.
  date: 2023-11-02
change note: Added a new rdfs:label in French.
  date: 2023-08-28
change note:
  date: 2021-01-22
  value: changed the IRI, label, inverse property IRI, text definition, corresponding CM component name (changed made in order to make RiC-O compliant with RiC-CM 0.2; the name of this property in RiC-O 0.1 was "hasPosition").
RiC-CM corresponding component: RiC-R056i ('has or had position' relation)

has or had rule type
type: ObjectProperty
sub property of: has or had type
inverse of: is or was rule type of
domain: Rule
range: Rule Type
comment: Connects a Rule to a Rule Type that categorized or categorizes it.
label: a ou a eu pour type de règle @fr
label: tiene o tenía como tipo de regla @es
change note: Added a new rdfs:label in Spanish.
  date: 2023-11-02
change note: Added a new rdfs:label in French.
  date: 2023-08-28
change note: changed the IRI, label, inverse property IRI, text definition, super property IRI (the name of this property in RiC-O 0.1 was "hasRuleType").
  date: 2021-01-22
change note: Object property added along with RuleType class and isRuleTypeOf object property.
  date: 2020-10-19

has or had some members whose content mainly represents
type: ObjectProperty
sub property of: has or had some members whose content represents
sub property of: has or had some members with main subject
inverse of: is or was main thing represented by content of some members of
domain: Record Set
range: Thing
comment: Connects a Record Set and a Thing that is the main element represented by the content of some of the members of the Records or Record Parts that are or were included in the Record Set.
label: inclut ou a inclus des membres dont le contenu représente principalement @fr
label: incluye o incluía algunos miembros cuyo contenido representa principalmente @es
change note: Introduced in RiC-O 1.1.
  date: 2025-04-06

has or had some members whose content represents
type: ObjectProperty
sub property of: has or had some members with subject
inverse of: is or was represented by content of some members of
domain: Record Set
range: Thing
comment: Connects a Record Set and a Thing that is represented by the content of some of the Records or Record Parts that are or were included in the Record Set.
label: inclut ou a inclus des membres dont le contenu représente @fr
label: incluye o incluía algunos miembros cuyo contenido representa @es
change note: Introduced in RiC-O 1.1.
  date: 2025-04-05

has or had some members with accumulation date
type: ObjectProperty
sub property of: is associated with date
inverse of: is or was accumulation date of some members of
domain: Record Set
range: Date
comment: Inverse of 'is or was accumulation date of some members of' object property.
label: inclut ou a inclus des membres ayant pour date d'accumulation @fr
label: incluye o incluía algunos miembros con fecha de acumulación @es
change note: Adjusted the Spanish label.
  date: 2025-04-06
change note: Added in RiC-O 1.1.
  date: 2024-10-04

has or had some members with content type
type: ObjectProperty
sub property of: has or had some members with type
inverse of: is or was content type of some members of
domain: Record Set
range: Content Type
comment: Connects a Record Set and a Content Type that categorizes some of the Records or Record Parts that are or were included in the Record Set.
label: inclut ou a inclus des membres ayant pour type de contenu @fr
label: incluye o incluía algunos miembros con tipo de contenido @es
change note: Adjusted the Spanish label.
  date: 2025-04-06
change note: Added a new rdfs:label in Spanish.
  date: 2023-11-02
change note: Added a new rdfs:label in French.
  date: 2023-08-28
change note:
  date: 2020-12-28
  value: Object property added for handling the case where a Record Set is described as having all or some members that belong to some category (see RiC-CM 0.2 attributes section, #4.4 on Record Set, Record and Record Part attributes).

has or had some members with creation date
type: ObjectProperty
sub property of: has beginning date
inverse of: is or was creation date of some members of
domain: Record Set
range: Date
comment: Inverse of 'is or was creation date of some members of' object property.
label: inclut ou a inclus des membres ayant pour date de création @fr
label: incluye o incluía algunos miembros con fecha de creación @es
change note: Adjusted the Spanish label.
  date: 2025-04-06
change note: Added a new rdfs:label in Spanish.
  date: 2023-11-27
change note: Renamed the property in order to take the past members of the record set into account. Adjusted the annotations accordingly.
  date: 2023-10-13
change note: Added the French label
  date: 2023-10-12
change note: Added in RiC-O 1.0.
  date: 2023-09-22
RiC-CM corresponding component: RiC-R082i ('has or had some members with creation date' relation)

has or had some members with documentary form type
type: ObjectProperty
sub property of: has or had some members with type
inverse of: is or was documentary form type of some members of
domain: Record Set
range: Documentary Form Type
comment: Connects a Record Set and a Documentary Form Type that categorizes some of the Records or Record Parts that are or were included in the Record Set.
label: inclut ou a inclus des membres ayant pour type de document @fr
label: incluye o incluía algunos miembros con tipo documental @es
change note: Adjusted the Spanish label.
  date: 2025-04-06
change note: Fixed a typo in IRI: changed 'with' to 'With'.
  date: 2024-03-15
change note: Added a new rdfs:label in Spanish.
  date: 2023-11-02
change note: Added a new rdfs:label in French.
  date: 2023-08-28
change note:
  date: 2020-12-28
  value: Object property added for handling the case where a Record Set is described as having all or some members that belong to some category (see RiC-CM 0.2 attributes section, #4.4 on Record Set, Record and Record Part attributes).

has or had some members with language
type: ObjectProperty
sub property of: is related to
inverse of: is or was language of some members of
domain: Record Set
range: Language
comment: Connects a Record Set and a Language used by some of the Records or Record Parts that are or were included in the Record Set.
label: inclut ou a inclus des membres ayant pour langue @fr
label: incluye o incluía algunos miembros con lengua @es
change note: Adjusted the Spanish label.
  date: 2025-04-06
change note: Added a new rdfs:label in Spanish.
  date: 2023-11-02
change note: Added a new rdfs:label in French.
  date: 2023-08-28
change note:
  date: 2020-12-28
  value: Object property added for handling the case where a Record Set is described as having all or some members that belong to some category (see RiC-CM 0.2 attributes section, #4.4 on Record Set, Record and Record Part attributes).

has or had some members with legal status
type: ObjectProperty
sub property of: has or had some members with type
inverse of: is or was legal status of some members of
domain: Record Set
range: Legal Status
comment: Connects a Record Set and a Legal Status that categorizes some of the Records or Record Parts that are or were included in the Record Set.
label: inclut ou a inclus des membres ayant pour statut légal @fr
label: incluye o incluía algunos miembros con status jurídico @es
change note: Adjusted the Spanish label.
  date: 2025-04-06
change note: Added a new rdfs:label in Spanish.
  date: 2023-11-02
change note: Added a new rdfs:label in French.
  date: 2023-08-28
change note:
  date: 2020-12-28
  value: Object property added for handling the case where a Record Set is described as having all or some members that belong to some category (see RiC-CM 0.2 attributes section, #4.4 on Record Set, Record and Record Part attributes).

has or had some members with main subject
type: ObjectProperty
sub property of: has or had some members with subject
inverse of: is or was main subject of some members of
domain: Record Set
range: Thing
comment: Connects a Record Set and a Thing that is the main subject of some of the Records or Record Parts that are or were included in the Record Set.
label: inclut ou a inclus des membres ayant pour sujet principal @fr
label: incluye o incluía algunos miembros con matería principal @es
change note: Introduced in RiC-O 1.1.
  date: 2025-04-05

has or had some members with record state
type: ObjectProperty
sub property of: has or had some members with type
inverse of: is or was record state of some members of
domain: Record Set
range: Record State
comment: Connects a Record Set and a Record State that categorizes some of the Records or Record Parts that are or were included in the Record Set.
label: inclut ou a inclus des membres ayant pour état @fr
label: incluye o incluía algunos miembros con estado de documento @es
change note: Adjusted the Spanish label.
  date: 2025-04-06
change note: Added a new rdfs:label in Spanish.
  date: 2023-11-02
change note: Added a new rdfs:label in French.
  date: 2023-08-28
change note:
  date: 2020-12-28
  value: Object property added for handling the case where a Record Set is described as having all or some members that belong to some category (see RiC-CM 0.2 attributes section, #4.4 on Record Set, Record and Record Part attributes).

has or had some members with subject
type: ObjectProperty
sub property of: is related to
inverse of: is or was subject of some members of
domain: Record Set
range: Thing
comment: Connects a Record Set and a Thing that is the subject of some of the Records or Record Parts that are or were included in the Record Set.
label: inclut ou a inclus des membres ayant pour sujet @fr
label: incluye o incluía algunos miembros con matería @es
change note: Adjusted the Spanish label.
  date: 2025-04-06
change note: Introduced in RiC-O 1.1.
  date: 2025-04-05

has or had some members with type
type: ObjectProperty
sub property of: is related to
inverse of: is or was type of some members of
domain: Record Set
range: Type
comment: Connects a Record Set and a Type to which some of the Records or Record Parts that are or were included in the Record Set belong.
label: inclut ou a inclus des membres ayant pour type @fr
label: incluye o incluía algunos miembros con tipo @es
change note: Adjusted the Spanish label.
  date: 2025-04-06
change note: Changed the word 'category' into 'type' in all applicable properties names.
  date: 2024-10-04
change note: Added a new rdfs:label in Spanish.
  date: 2023-11-02
change note: Added a new rdfs:label in French.
  date: 2023-08-28
change note:
  date: 2020-12-28
  value: Object property added for handling the case where a Record Set is described as having all or some members that belong to some category (see RiC-CM 0.2 attributes section, #4.4 on Record Set, Record and Record Part attributes).

has or had spouse
type: ObjectProperty
sub property of: has family association with
type: SymmetricProperty
domain: Person
range: Person
property chain axiom: thing is connected to relation
property chain axiom: has the role of the Spouse Relation
property chain axiom: relation connects
comment: Connects two Persons who are or were married. This relation is symmetric.
label: a ou a eu pour conjoint @fr
label: tiene o tenía como cónyuge a @es
change note: Aligned with RiC-CM 1.0: updated the description (rdfs:comment).
  date: 2023-11-12
change note: In order to get a system of rolified Relation classes: modified the property chain axiom so that it now involves the new spouseRelation_role object property.
  date: 2023-11-08
change note: Added a new rdfs:label in Spanish.
  date: 2023-11-02
change note: Added a new rdfs:label in French.
  date: 2023-08-28
change note:
  date: 2021-01-22
  value: changed the IRI, label, inverse property IRI, text definition, super property IRI (changed made in order to make RiC-O compliant with RiC-CM 0.2; the name of this property in RiC-O 0.1 was "hasSpouse").
RiC-CM corresponding component: RiC-R049 ('has or had spouse' relation)

has or had student
type: ObjectProperty
sub property of: knows
inverse of: has or had teacher
domain: Person
range: Person
property chain axiom: thing is source of relation
property chain axiom: has the role of the Teaching Relation
property chain axiom: relation has target
comment: Inverse of 'has or had teacher' object property.
label: a ou a eu pour étudiant @fr
label: tiene o tenía como estudiante a @es
change note: In order to get a system of rolified Relation classes: modified the property chain axiom so that it now involves the new teachingRelation_role object property.
  date: 2023-11-08
change note: Added a new rdfs:label in Spanish.
  date: 2023-11-02
change note: Added a new rdfs:label in French.
  date: 2023-08-28
change note: changed the IRI, label, inverse property IRI, text definition (changed made in order to make RiC-O compliant with RiC-CM 0.2; the name of this property in RiC-O 0.1 was "hasStudent").
  date: 2021-01-22
RiC-CM corresponding component: RiC-R053i ('has or had student' relation)

has or had subdivision
type: ObjectProperty
sub property of: has or had part
sub property of: has or had subordinate
inverse of: is or was subdivision of
domain: Group
range: Group
property chain axiom: thing is source of relation
property chain axiom: has the role of the Group Subdivision Relation
property chain axiom: relation has target
comment: Connects a Group to one of its present or past subdivisions.
label: a ou a eu pour subdivision @fr
label: tiene o tenía como subdivisión @es
change note: In order to get a system of rolified Relation classes: modified the property chain axiom so that it now involves the new groupSubdivisionRelation_role object property.
  date: 2023-11-08
change note: Added a new rdfs:label in Spanish.
  date: 2023-11-02
change note: Added a new rdfs:label in French.
  date: 2023-08-28
change note:
  date: 2021-01-22
  value: changed the IRI, label, inverse property IRI, text definition, super property IRIs (changed made in order to make RiC-O compliant with RiC-CM 0.2; the name of this property in RiC-O 0.1 was "hasSubdivision").
RiC-CM corresponding component: RiC-R005 ('has or had subdivision' relation)

has or had subevent
type: ObjectProperty
sub property of: has or had part
sub property of: is associated with event
sub property of: is event associated with
inverse of: is or was subevent of
domain: Event
range: Event
comment: Connects an Event to one of a series of Events that constitute the original, broader, past or ongoing Event.
label: est ou a été constitué de l’événement @fr
label: tiene o tenía como parte de evento @es
change note: Added a new rdfs:label in Spanish.
  date: 2023-11-02
change note: Added a new rdfs:label in French.
  date: 2023-08-28
change note:
  date: 2021-01-22
  value: changed the IRI, label, inverse property IRI, text definition, super property IRI (changed made in order to make RiC-O compliant with RiC-CM 0.2; the name of this property in RiC-O 0.1 was "hasSubEvent").
scope note: Since an Activity is a kind of Event, this Relation can also be used for Activity.
RiC-CM corresponding component: RiC-R006 ('has or had subevent' relation)

has or had subject
type: ObjectProperty
sub property of: is related to
inverse of: is or was subject of
domain: Record Resource
range: Thing
comment: Connects a Record Resource to a Thing that is or was its subject.
label: a ou a eu pour sujet @fr
label: tiene o tenía como materia @es
change note: Aligned with RiC-CM 1.0: updated the skos:scopeNote.
  date: 2023-11-12
change note: Added a new rdfs:label in Spanish.
  date: 2023-11-02
change note: Added a new rdfs:label in French.
  date: 2023-08-28
change note: changed the IRI, label, inverse property IRI, text definition (changed made in order to make RiC-O compliant with RiC-CM 0.2; the name of this property in RiC-O 0.1 was "hasSubject").
  date: 2021-01-22
scope note: The subject of a Record Set may be affected if the Record Set loses some of the Records.
RiC-CM corresponding component: RiC-R019 ('has or had subject' relation)

has or had subordinate
type: ObjectProperty
sub property of: is agent associated with agent
inverse of: is or was subordinate to
domain: Agent
range: Agent
property chain axiom: thing is source of relation
property chain axiom: has the role of the Agent Hierarchical Relation
property chain axiom: relation has target
comment: Connects an Agent to an Agent that is hierarchically inferior.
label: a ou a eu pour subalterne @fr
label: tiene o tenía como subordinado o subordinada a @es
change note: Aligned with RiC-CM 1.0: updated the skos:scopeNote.
  date: 2023-11-12
change note: In order to get a system of rolified Relation classes: modified the property chain axiom so that it now involves the new agentHierarchicalRelation_role object property.
  date: 2023-11-08
change note: Added a new rdfs:label in Spanish.
  date: 2023-11-02
change note: Added a new rdfs:label in French.
  date: 2023-08-28
change note: changed the IRI, label, inverse property IRI (changed made in order to make RiC-O compliant with RiC-CM 0.2; the name of this property in RiC-O 0.1 was "isHierarchicallySuperiorTo").
  date: 2021-01-22
scope note: The hierarchical relation can be an authority relation, or a whole/part relation between two Agents.
RiC-CM corresponding component: RiC-R045 ('has or had subordinate ' relation)

has or had teacher
type: ObjectProperty
sub property of: knows
inverse of: has or had student
domain: Person
range: Person
property chain axiom: thing is target of relation
property chain axiom: has the role of the Teaching Relation
property chain axiom: relation has source
comment: Connects a Person to another Person who is or was their teacher.
label: a ou a eu pour enseignant @fr
label: tiene o tenía como profesor(a) a @es
change note: Aligned with RiC-CM 1.0: updated the description (rdfs:comment).
  date: 2023-11-12
change note: In order to get a system of rolified Relation classes: modified the property chain axiom so that it now involves the new teachingRelation_role object property.
  date: 2023-11-08
change note: Added a new rdfs:label in Spanish.
  date: 2023-11-02
change note: Added a new rdfs:label in French.
  date: 2023-08-28
change note: changed the IRI, label, inverse property IRI, text definition (changed made in order to make RiC-O compliant with RiC-CM 0.2; the name of this property in RiC-O 0.1 was "hasTeacher").
  date: 2021-01-22
RiC-CM corresponding component: RiC-R053 ('has or had teacher' relation)

has or had title
type: ObjectProperty
sub property of: has or had name
inverse of: is or was title of
domain: Class
  union of: Instantiation
  union of: Record Resource
  union of: Rule
range: Title
comment: Connects a Record Resource, Instantiation or Rule to a title that is or was used for designating it.
label: a ou a eu pour intitulé @fr
label: tiene o tenía como título @es
change note: Added a new rdfs:label in Spanish.
  date: 2023-11-02
change note: Added a new rdfs:label in French.
  date: 2023-08-28
change note: changed the IRI, label, inverse property IRI, text definition, super property IRI (the name of this property in RiC-O 0.1 was "hasTitle").
  date: 2021-01-22

has or had type
type: ObjectProperty
sub property of: is related to
inverse of: is or was type of
domain: Thing
range: Type
property chain axiom: thing is target of relation
property chain axiom: has the role of the Type Relation
property chain axiom: relation has source
comment: Connects a Thing to a Type that categorizes or categorized it.
label: a ou a eu pour type @fr
label: tiene o tenía como tipo @es
change note: Changed the word 'category' into 'type' in all applicable properties names.
  date: 2024-10-04
change note: In order to get a system of rolified Relation classes: modified the property chain axiom so that it now involves the new typeRelation_role object property.
  date: 2023-11-08
change note: Added a new rdfs:label in Spanish.
  date: 2023-11-02
change note: Added a new rdfs:label in French.
  date: 2023-08-28
change note: changed the IRI, label, inverse property IRI, text definition (the name of this property in RiC-O 0.1 was "belongsToCategory").
  date: 2021-01-22

has or had work relation with
type: ObjectProperty
sub property of: is agent associated with agent
type: SymmetricProperty
domain: Agent
range: Agent
property chain axiom: thing is connected to relation
property chain axiom: has the role of the Work Relation
property chain axiom: relation connects
comment: Connects two Agents that have or had some type of work relation in the course of their activities. This relation is symmetric.
label: a ou a eu une relation professionnelle avec @fr
label: tiene o tenía relación profesional con @es
change note: In order to get a system of rolified Relation classes: modified the property chain axiom so that it now involves the new workRelation_role object property.
  date: 2023-11-08
change note: Added the property chain axiom so that this property is formally defined as a shortcut.
  date: 2023-11-07
change note: Added a new rdfs:label in Spanish.
  date: 2023-11-02
change note: Added a new rdfs:label in French.
  date: 2023-08-28
change note: changed the IRI, label, text definition (changed made in order to make RiC-O compliant with RiC-CM 0.2; the name of this property in RiC-O 0.1 was "hasWorkRelationWith").
  date: 2021-01-22
RiC-CM corresponding component: RiC-R046 ('has or had work relation with' relation)

has organic or functional provenance
type: ObjectProperty
sub property of: is related to
inverse of: is organic or functional provenance of
domain: Class
  union of: Instantiation
  union of: Record Resource
range: Class
  union of: Activity
  union of: Agent
property chain axiom: thing is source of relation
property chain axiom: has the role of the Organic or functional provenance Relation
property chain axiom: relation has target
comment: Connects a Record Resource or an Instantiation to an Agent that creates or accumulates it, receives it, or sends it, or to an Activity that generates it.
label: a pour provenance organique ou fonctionnelle @fr
label: tiene como procedencia orgánica o funcional @es
change note: In order to get a system of rolified Relation classes: modified the property chain axiom so that it now involves the new organicOrFunctionalProvenanceRelation_role object property.
  date: 2023-11-08
change note: Property added as a superproperty of hasProvenance and documents, along with its inverse property. Shortcut also added.
  date: 2023-11-07

has organic provenance
type: ObjectProperty
sub property of: has organic or functional provenance
inverse of: is organic provenance of
domain: Class
  union of: Instantiation
  union of: Record Resource
range: Agent
property chain axiom: thing is source of relation
property chain axiom: has the role of the Organic Provenance Relation
property chain axiom: relation has target
comment: Connects a Record Resource or an Instantiation to an Agent that creates or accumulates the Record Resource, receives it, or sends it.
label: a pour provenance organique @fr
label: tiene como procedencia orgánica @es
change note: Aligned with RiC-CM 1.0: updated the skos:scopeNote.
  date: 2023-11-12
change note: In order to get a system of rolified Relation classes: modified the property chain axiom so that it now involves the new organicProvenanceRelation_role object property.
  date: 2023-11-08
change note: Made this property a subproperty of the new hasOrganicOrFunctionalProvenance property. Renamed it to make things clearer. Adjusted its labels.
  date: 2023-11-07
change note: Added a new rdfs:label in Spanish.
  date: 2023-11-02
change note: Added a new rdfs:label in French.
  date: 2023-08-28
scope note: This is the most general organic provenance relation. Use it to connect a Record Resource or Instantiation with an Agent only if it is not possible to use a narrower, more specific relation, for example has creator.
RiC-CM corresponding component: RiC-R026 ('has provenance' relation)

has organic provenance date
type: ObjectProperty
sub property of: is associated with date
inverse of: is organic provenance date of
domain: Class
  union of: Instantiation
  union of: Record Resource
range: Date
property chain axiom: thing is source of relation
property chain axiom: has the role of the Organic Provenance Relation
property chain axiom: relation has date
comment: Inverse of 'is date associated with organic provenance of' object property.
label: a pour date de provenance organique @fr
label: tiene como fecha de procedencia orgánica @es
change note: Added French and Spanish labels.
  date: 2025-03-13
change note: Added in RiC-O 1.1.
  date: 2024-12-19

has original
type: ObjectProperty
sub property of: follows in time
sub property of: has genetic link to record resource
inverse of: is original of
domain: Class
  union of: Documento
  union of: Record Part
range: Class
  union of: Documento
  union of: Record Part
comment: Inverse of 'is original of' object property.
label: a pour original @fr
label: tiene como original @es
change note: Added a new rdfs:label in Spanish.
  date: 2023-11-02
change note: Added a new rdfs:label in French.
  date: 2023-08-28
RiC-CM corresponding component: RiC-R010i ('is original of' relation)

has part transitive
type: ObjectProperty
sub property of: has or had part
type: TransitiveProperty
inverse of: is part of transitive
domain: Thing
range: Thing
comment: Connects a Thing to a Thing that is, directly or indirectly, a constitutive or component part of that Thing. This is a transitive relation.
label: a pour partie transitif @fr
label: tiene como parte transitivo @es
change note: Added a new rdfs:label in Spanish.
  date: 2023-11-27
change note: Updated the labels.
  date: 2023-11-12
change note: Object property added, along with its inverse property, in order to enable to express current partitive relations between things (the past partitive relation also being added).
  date: 2023-07-12
scope note: To be used, either to infer, then query or browse, relations from existing direct 'hasDirectPart' relations between things, or to record a current partitive relation when you do not know if there are intermediate nodes between the related things.

has production technique type
type: ObjectProperty
sub property of: has or had type
inverse of: is production technique type of
domain: Instantiation
range: Production Technique Type
comment: Connects an Instantiation to a Production Technique Type that categorizes its production technique.
label: a pour type de technique de production @fr
label: tiene como técnica de producción @es
change note: Added a new rdfs:label in Spanish.
  date: 2023-11-02
change note: Added a new rdfs:label in French.
  date: 2023-08-28
change note: changed the super property IRI.
  date: 2021-01-22

has proxy
type: ObjectProperty
sub property of: is related to
inverse of: proxy for
domain: Record Resource
range: Proxy
comment: Inverse of 'proxy for' object property.
label: a pour proxy @fr
label: tiene como proxy @es
change note: Added the French and Spanish labels.
  date: 2025-04-02
change note: Introduced in RiC-O 1.1
  date: 2025-03-04

has publication date
type: ObjectProperty
sub property of: is associated with date
inverse of: is publication date of
domain: Record Resource
range: Date
comment: Inverse of 'is publication date of' object property.
label: a pour date de publication @fr
label: tiene como fecha de publicación @es
change note: Added a new rdfs:label in Spanish.
  date: 2023-11-27
change note: Added the French label
  date: 2023-10-12
change note: Added in RiC-O 1.0.
  date: 2023-09-22

has publisher
type: ObjectProperty
sub property of: is related to
inverse of: is publisher of
domain: Record Resource
range: Agent
comment: Connects a Record resource to an Agent who published it.
label: a pour éditeur @fr
label: tiene como editor(a) a @es
change note: Added a new rdfs:label in Spanish.
  date: 2023-11-02
change note: Added a new rdfs:label in French.
  date: 2023-08-28
change note: changed the IRI, label, inverse property IRI (the name of this property in RiC-O 0.1 was "publishedBy").
  date: 2021-01-22

has receiver
type: ObjectProperty
sub property of: has accumulator
inverse of: is receiver of
domain: Class
  union of: Instantiation
  union of: Record Resource
range: Agent
comment: Connects a Record Resource or an Instantiation to the Agent that receives it in the course of the Agent's activities.
label: est reçu par @fr
label: tiene como receptor(a) a @es
change note: Aligned with RiC-CM 1.0: updated the description (rdfs:comment).
  date: 2023-11-12
change note: Added a new rdfs:label in Spanish.
  date: 2023-11-02
change note: Added a new rdfs:label in French.
  date: 2023-08-28
change note: Added a new rdfs:label in French.
  date: 2023-08-28
change note: changed the IRI, label, inverse property IRI, super property IRI (changed made in order to make RiC-O compliant with RiC-CM 0.2; the name of this property in RiC-O 0.1 was "receivedBy").
  date: 2021-01-22
RiC-CM corresponding component: RiC-R029 ('has receiver' relation)

has record set type
type: ObjectProperty
sub property of: has or had type
inverse of: is record set type of
domain: Record Set
range: Record Set Type
comment: Connects a Record Set to a Record Set Type that categorizes it.
label: a pour type d’ensemble d’objets informationnels @fr
label: tiene como tipo de agrupación documental @es
change note: Added a new rdfs:label in Spanish.
  date: 2023-11-02
change note: Added a new rdfs:label in French.
  date: 2023-08-28
change note: changed the super property IRI.
  date: 2021-01-22

has record state
type: ObjectProperty
sub property of: has or had type
inverse of: is record state of
domain: Class
  union of: Documento
  union of: Record Part
range: Record State
comment: Connects a Record or Record Part to a Record State that categorizes its state.
label: a pour état @fr
label: tiene como estado de documento @es
change note: Added a new rdfs:label in Spanish.
  date: 2023-11-02
change note: Added a new rdfs:label in French.
  date: 2023-08-28
change note: Changed the IRI (hasRecordResourceState changed to hasRecordState), label, textual definition and domain (RecordResource replaced by Record or Record Part).
  date: 2020-12-28

has reply
type: ObjectProperty
sub property of: is record resource associated with record resource
sub property of: precedes in time
inverse of: is reply to
domain: Record Resource
range: Record Resource
comment: Connects a Record Resource to a reply, usually in the form of correspondence.
label: a pour réponse @fr
label: tiene como contestación @es
change note: Added a new rdfs:label in Spanish.
  date: 2023-11-02
change note: Added a new rdfs:label in French.
  date: 2023-08-28
change note: changed the IRI, label, inverse property IRI, text definition (changed made in order to make RiC-O compliant with RiC-CM 0.2; the name of this property in RiC-O 0.1 was "isRepliedToBy").
  date: 2021-01-22
RiC-CM corresponding component: RiC-R013 ('has reply' relation)

has representation type
type: ObjectProperty
sub property of: has or had type
inverse of: is representation type of
domain: Instantiation
range: Representation Type
comment: Connects an Instantiation to a Representation Type that categorizes its representation type.
label: a pour type de représentation @fr
label: tiene como tipo de grabación @es
change note: Added a new rdfs:label in Spanish.
  date: 2023-11-02
change note: Added a new rdfs:label in French.
  date: 2023-08-28
change note: changed the super property IRI.
  date: 2021-01-22

has sender
type: ObjectProperty
sub property of: has organic provenance
inverse of: is sender of
domain: Class
  union of: Instantiation
  union of: Record Resource
range: Agent
comment: Connects a Record Resource or an Instantiation to the Agent that sends it
label: a pour expéditeur @fr
label: tiene como remitente a @es
change note: Aligned with RiC-CM 1.0: updated the skos:scopeNote.
  date: 2023-11-12
change note: Added a new rdfs:label in Spanish.
  date: 2023-11-02
change note: Added a new rdfs:label in French.
  date: 2023-08-28
scope note: The identity of the sender is (usually) evidenced by the Record Resource or Instantiation itself.
RiC-CM corresponding component: RiC-R031 ('has sender' relation)

has sibling
type: ObjectProperty
sub property of: has family association with
type: SymmetricProperty
domain: Person
range: Person
property chain axiom: thing is connected to relation
property chain axiom: has the role of the Sibling Relation
property chain axiom: relation connects
comment: Connects two Persons who are siblings. This relation is symmetric.
label: a pour frère ou sœur @fr
label: tiene como hermano o hermana a @es
change note: Aligned with RiC-CM 1.0: updated the description (rdfs:comment).
  date: 2023-11-12
change note: In order to get a system of rolified Relation classes: modified the property chain axiom so that it now involves the new siblingRelation_role object property.
  date: 2023-11-08
change note: Added a new rdfs:label in Spanish.
  date: 2023-11-02
change note: Added a new rdfs:label in French.
  date: 2023-08-28
change note: changed the super property IRI.
  date: 2021-01-22
RiC-CM corresponding component: RiC-R048 ('has sibling' relation)

has subdivision transitive
type: ObjectProperty
sub property of: has or had subdivision
sub property of: has part transitive
sub property of: has subordinate transitive
type: TransitiveProperty
inverse of: is subdivision of transitive
domain: Group
range: Group
comment: Connects a Group to another Group that is one of its direct or indirect subdivisions. This is a transitive relation.
label: a pour subdivision transitif @fr
label: tiene como subdivisión transitivo @es
change note: Added a new rdfs:label in Spanish.
  date: 2023-11-27
change note: Fixed the French label.
  date: 2023-11-25
change note: Updated the labels.
  date: 2023-11-12
change note: Object property added, along with its inverse property, in order to enable to express current partitive relations between groups (the past partitive relation also being added).
  date: 2023-09-08

has subevent transitive
type: ObjectProperty
sub property of: has or had subevent
sub property of: has part transitive
type: TransitiveProperty
inverse of: is subevent of transitive
domain: Event
range: Event
comment: Connects an ongoing Event to one of a series of Events that directly or indirectly constitute that broader, ongoing Event. This is a transitive relation.
label: est constitué de l’événement transitif @fr
label: tiene como parte de evento transitivo @es
change note: Fixed the Spanish label.
  date: 2024-10-21
change note: Added a new rdfs:label in Spanish.
  date: 2023-11-27
change note: Updated the labels.
  date: 2023-11-12
change note: Object property added, along with its inverse property, in order to enable to express partitive relations between ongoing events (the past partitive relation also being added).
  date: 2023-09-08

has subordinate transitive
type: ObjectProperty
sub property of: has or had subordinate
type: TransitiveProperty
inverse of: is subordinate to transitive
domain: Agent
range: Agent
comment: Connects an Agent to an Agent that is directly or indirectly hierarchically inferior. This is a transitive relation.
label: a pour subalterne transitif @fr
label: tiene como subordinado o subordinada a transitivo @es
change note: Added a new rdfs:label in Spanish.
  date: 2023-11-27
change note: Updated the labels.
  date: 2023-11-12
change note: Object property added, along with its inverse property, in order to enable to express current subordination relations between agents (the past subordination relation also being added).
  date: 2023-09-08

has successor
type: ObjectProperty
sub property of: is agent associated with agent
sub property of: precedes in time
inverse of: is successor of
domain: Agent
range: Agent
property chain axiom: thing is source of relation
property chain axiom: has the role of the Agent Temporal Relation
property chain axiom: relation has target
comment: Connects an Agent to another Agent that succeeds it chronologically.
label: a pour successeur @fr
label: tiene como sucesor(a) a @es
change note: In order to get a system of rolified Relation classes: modified the property chain axiom so that it now involves the new agentTemporalRelation_role object property.
  date: 2023-11-08
change note: Added a new rdfs:label in Spanish.
  date: 2023-11-02
change note: Added a new rdfs:label in French.
  date: 2023-08-28
change note: changed the IRI and label (changed made in order to make RiC-O compliant with RiC-CM 0.2; the name of this property in RiC-O 0.1 was "isAntecedentOf").
  date: 2021-01-22
scope note: There may be zero to many intermediate Agents, ignored or unknown, between the two connected Agents. Can be used when there is a transfer of function from the first Agent to the second Agent.
RiC-CM corresponding component: RIC-R016 ('has successor' relation)

has title type
type: ObjectProperty
sub property of: has or had type
inverse of: is title type of
domain: Title
range: Title Type
comment: Connects a Title and a Title Type that categorizes it.
label: a pour type de titre @fr
label: tiene como tipo de título @es
change note: Object property added along with TitleType class and isTitleTypeOf object property.
  date: 2024-10-04

has unit of measurement
type: ObjectProperty
sub property of: is related to
inverse of: is unit of measurement of
domain: Extent
range: Unit Of Measurement
comment: Connects an Extent to a Unit Of Measurement
label: a pour unité de mesure @fr
label: tiene como unidad de medida @es
change note: Added a new rdfs:label in Spanish.
  date: 2023-11-02
change note: Added a new rdfs:label in French; added an xml:lang attribute to the rdfs:comment.
  date: 2023-08-28
change note: Object property created along with Extent and UnitOfMeasurement classes, in order to provide methods for handling extent accurately.
  date: 2020-10-28

has within
type: ObjectProperty
sub property of: has or had part
sub property of: is associated with date
sub property of: is date associated with
inverse of: is within
domain: Date
range: Date
comment: Inverse of 'is within' object property.
label: contient @fr
label: tiene dentro @es
change note: Added a new rdfs:label in Spanish.
  date: 2023-11-27
change note: made this property a subproperty of both isDateAssociatedWith and isAssociatedWithdate, and of hasOrHadPart.
  date: 2023-10-13
change note: Added the property
  date: 2023-10-12
RiC-CM corresponding component: RiC-R085i ('has within' relation)

included
type: ObjectProperty
sub property of: had part
sub property of: includes or included
inverse of: was included in
domain: Record Set
range: Class
  union of: Documento
  union of: Record Set
comment: Connects a Record Set to a Record or Record Set which it included in the past.
label: a inclus @fr
label: incluía @es
change note: Added a new rdfs:label in Spanish.
  date: 2023-11-27
change note: Added a French label.
  date: 2023-11-13
change note:
  date: 2023-09-08
  value: Object property added, along with its inverse property, in order to enable to express past partitive relations between Record Sets and their members (the current partitive relations being also added, including a transitive one).

includes or included
type: ObjectProperty
sub property of: has or had part
sub property of: is record resource associated with record resource
inverse of: is or was included in
domain: Record Set
range: Class
  union of: Documento
  union of: Record Set
comment: Connects a Record Set to a Record or Record Set it aggregates, or aggregated in the past.
label: inclut ou a inclus @fr
label: incluye o incluía @es
change note: Added a new rdfs:label in Spanish.
  date: 2023-11-02
change note: Added a new rdfs:label in French.
  date: 2023-08-28
change note: Made this object property a subproperty of hasOrHadPart.
  date: 2023-06-05
change note: changed the IRI, label, inverse property IRI, text definition (changed made in order to make RiC-O compliant with RiC-CM 0.2; the name of this property in RiC-O 0.1 was "includes").
  date: 2021-01-22
scope note: A Record or Record Set can be aggregated in one or many Record Sets simultaneously or through time.
RiC-CM corresponding component: RiC-R024 ('includes or included' relation)

includes proxy
type: ObjectProperty
sub property of: has part transitive
inverse of: proxy is included in
domain: Record Set
range: Proxy
property chain axiom: proxy includes proxy transitive
comment: Inverse of 'proxy is included in' object property.
label: inclut le proxy @fr
label: incluye el proxy @es
change note: Added the French and Spanish labels.
  date: 2025-04-02
change note: Fixed the owl:inverseOf (was set to isPartOfTransitive).
  date: 2025-04-02
change note: Introduced in RiC-O 1.1.
  date: 2025-03-04

includes transitive
type: ObjectProperty
sub property of: has part transitive
sub property of: includes or included
type: TransitiveProperty
inverse of: is included in transitive
domain: Record Set
range: Class
  union of: Documento
  union of: Record Set
property chain axiom: includes proxy
property chain axiom: proxy includes
comment: Connects a Record Set to a Record or Record Set which it includes directly or indirectly. This is a transitive relation.
label: inclut transitif @fr
label: incluye transitivo @es
change note: Added a property chain axiom relating it to use of rico:Proxy
  date: 2025-03-04
change note: Added a new rdfs:label in Spanish.
  date: 2023-11-27
change note: Added two labels.
  date: 2023-11-13
change note: Object property added, along with its inverse property, in order to enable to express current partitive relations between Record Sets and their members (the past partitive relation also being added).
  date: 2023-09-08

has the role of the Instantiation to Instantiation Relation
type: ObjectProperty
sub property of: has the role of the Relation
domain: Instantiation to Instantiation Relation
range: Instantiation to Instantiation Relation
comment: Connects an InstantiationToInstantiationRelation to itself. It is a property that can stand for an instance of the class when necessary, e.g. when you explore a knowledge graph.
label: a le rôle de la Relation entre instanciations @fr
label: desempeña el papel de la Relación entre instanciaciones @es
change note: Removed global reflexivity (leads to inconsistency).
  date: 2024-08-02
change note:
  date: 2023-11-08
  value: In order to get a system of rolified Relation classes: created the object property, with domain and range the InstantiationToInstantiationRelation rolified class. Declared it as reflexive. Declared it(s) superproperty(ies).
scope note: This property "rolifies" the InstantiationToInstantiationRelation class. It should be used only when you have to manage instances of the InstantiationToInstantiationRelation class, to connect each instance to itself, in order to be able to infer, using OWL-RL and property paths, the two shortcuts corresponding to this n-ary class.

has the role of the Intellectual Property Rights Relation
type: ObjectProperty
sub property of: has the role of the Authority Relation
domain: Intellectual Property Rights Relation
range: Intellectual Property Rights Relation
comment: Connects an IntellectualPropertyRightsRelation to itself. It is a property that can stand for an instance of the class when necessary, e.g. when you explore a knowledge graph.
label: a le rôle de la Relation de propriété intellectuelle @fr
label: desempeña el papel de la Relación de propiedad intelectual @es
change note: Removed global reflexivity (leads to inconsistency).
  date: 2024-08-02
change note:
  date: 2023-11-08
  value: In order to get a system of rolified Relation classes: created the object property, with domain and range the IntellectualPropertyRightsRelation rolified class. Declared it as reflexive. Declared it(s) superproperty(ies).
scope note: This property "rolifies" the IntellectualPropertyRightsRelation class. It should be used only when you have to manage instances of the IntellectualPropertyRightsRelation class, to connect each instance to itself, in order to be able to infer, using OWL-RL and property paths, the two shortcuts corresponding to this n-ary class.

intersects
type: ObjectProperty
sub property of: is associated with date
sub property of: is date associated with
type: SymmetricProperty
domain: Date
range: Date
comment: Connects two Dates that overlap. This relation is symmetric.
label: cruza @es
label: intersecte @fr
change note: Added a new rdfs:label in Spanish.
  date: 2023-11-27
change note: made this property a subproperty of isAssociatedWithdate.
  date: 2023-10-13
change note: Added the property
  date: 2023-10-12
RiC-CM corresponding component: RiC-R086 ('intersects' relation)

is accumulation date of
type: ObjectProperty
sub property of: is organic provenance date of
inverse of: has accumulation date
domain: Date
range: Class
  union of: Instantiation
  union of: Record Resource
property chain axiom: is date associated with Relation
property chain axiom: has the role of the Accumulation Relation
property chain axiom: relation has source
comment: Connects a Date to a Record Resource or Instantiation that was or will be accumulated at this Date.
label: es fecha de acumulación de @es
label: est la date d'accumulation de @fr
change note: Changed definition (added "or will be").
  date: 2025-02-19
change note: Connect to AccumulationRelation via a sub-property chain, and make a sub-property of the new 'isOrganicProvenanceDateOf' object property.
  date: 2024-12-19
change note: Added in RiC-O 1.1.
  date: 2024-10-04
scope note: When used for a Record Set (e.g. a file), it is the accumulation date of the Record Set itself rather than the accumulation date of the members of the Record Set. To record the accumulation date of members of the Record Set, use 'is or was accumulation date of all members of', 'is or was accumulation date of most members of’ or 'is or was accumulation date of some members of’.

is accumulator of
type: ObjectProperty
sub property of: is organic provenance of
inverse of: has accumulator
domain: Agent
range: Class
  union of: Instantiation
  union of: Record Resource
property chain axiom: thing is target of relation
property chain axiom: has the role of the Accumulation Relation
property chain axiom: relation has source
comment: Inverse of 'has accumulator' object property.
label: accumule @fr
label: es acumulador(a) de @es
change note: In order to get a system of rolified Relation classes: modified the property chain axiom so that it now involves the new accumulationRelation_role object property.
  date: 2023-11-08
change note: Added a new rdfs:label in Spanish.
  date: 2023-11-02
change note: Added a new rdfs:label in French.
  date: 2023-08-28
change note:
  date: 2021-01-22
  value: changed the IRI, label, inverse property IRI, text definition and corresponding CM component (changed made in order to make RiC-O compliant with RiC-CM 0.2; the name of this property in RiC-O 0.1 was "accumulates").
RiC-CM corresponding component: RiC-R028i ('is accumulator of' relation)

is activity type of
type: ObjectProperty
sub property of: is or was type of
inverse of: has activity type
domain: Activity Type
range: Activity
comment: Connects an Activity Type to an Activity that it categorizes.
label: es tipo de actividad de @es
label: est le type d’activité de @fr
change note: Added a new rdfs:label in Spanish.
  date: 2023-11-02
change note: Added a new rdfs:label in French.
  date: 2023-08-28
change note: changed the super property IRI.
  date: 2021-01-22

is addressee of
type: ObjectProperty
sub property of: is organic provenance of
inverse of: has addressee
domain: Agent
range: Class
  union of: Instantiation
  union of: Record Resource
comment: Inverse of 'has addressee' object property.
label: es destino de @es
label: est le destinataire de @fr
change note: Added a new rdfs:label in Spanish.
  date: 2023-11-02
change note: Added a new rdfs:label in French.
  date: 2023-08-28
RiC-CM corresponding component: RiC-032i ('is addressee of' relation)

is agent associated with agent
type: ObjectProperty
sub property of: is related to
type: SymmetricProperty
domain: Agent
range: Agent
property chain axiom: thing is connected to relation
property chain axiom: has the role of the Agent Relation
property chain axiom: relation connects
comment: Connects two Agents. This object property is symmetric.
label: agente está asociado con agente @es
label: est un agent associé à l’agent @fr
change note: Fixed the French label.
  date: 2023-11-25
change note: Aligned with RiC-CM 1.0: updated the skos:scopeNote.
  date: 2023-11-12
change note: In order to get a system of rolified Relation classes: modified the property chain axiom so that it now involves the new agentToAgentRelation_role object property.
  date: 2023-11-08
change note: Added a new rdfs:label in Spanish.
  date: 2023-11-02
change note: Added a new rdfs:label in French.
  date: 2023-08-28
scope note: Use only if it is not possible to specify a narrower Agent to Agent relation, for example has or had work relation with.
RiC-CM corresponding component: RiC-R044 ('is agent associated with agent' relation)

is agent associated with place
type: ObjectProperty
sub property of: is associated with place
inverse of: is place associated with agent
domain: Agent
range: Place
comment: Inverse of 'is place associated with agent' object property.
label: agente está asociado con lugar @es
label: est un agent associé au lieu @fr
change note: Added a new rdfs:label in Spanish.
  date: 2023-11-27
change note: Added a rdfs:comment.
  date: 2023-10-26
change note: Added for RiC-O v1.0.
  date: 2023-10-19

is associated with date
type: ObjectProperty
sub property of: is related to
inverse of: is date associated with
domain: Thing
range: Date
comment: Inverse of 'is date associated with' object property.
label: está asociado con fecha @es
label: est associé à la date @fr
change note: Added a new rdfs:label in Spanish.
  date: 2023-11-02
change note: Added a new rdfs:label in French.
  date: 2023-08-28
RiC-CM corresponding component: RiC-R068i ('is associated with date' relation)

is associated with event
type: ObjectProperty
sub property of: is related to
inverse of: is event associated with
domain: Thing
range: Event
property chain axiom: thing is target of relation
property chain axiom: has the role of the Event Relation
property chain axiom: relation has source
comment: Inverse of 'is event associated with' object property.
label: está asociado con evento @es
label: est associé à l’événement @fr
change note: In order to get a system of rolified Relation classes: modified the property chain axiom so that it now involves the new eventRelation_role object property.
  date: 2023-11-08
change note: Added a new rdfs:label in Spanish.
  date: 2023-11-02
change note: Added a new rdfs:label in French.
  date: 2023-08-28
RiC-CM corresponding component: RiC-R057i ('is associated with event' relation)

is associated with place
type: ObjectProperty
sub property of: is related to
inverse of: is place associated with
domain: Thing
range: Place
property chain axiom: thing is target of relation
property chain axiom: has the role of the Place Relation
property chain axiom: relation has source
comment: Inverse of 'is place associated with' object property.
label: está asociado con lugar @es
label: est associé au lieu @fr
change note: In order to get a system of rolified Relation classes: modified the property chain axiom so that it now involves the new placeRelation_role object property.
  date: 2023-11-08
change note: Added a new rdfs:label in Spanish.
  date: 2023-11-02
change note: Added a new rdfs:label in French.
  date: 2023-08-28
RiC-CM corresponding component: RiC-R074i ('is associated with place' relation)

is associated with rule
type: ObjectProperty
sub property of: is related to
inverse of: is rule associated with
domain: Thing
range: Rule
property chain axiom: thing is target of relation
property chain axiom: has the role of the Rule Relation
property chain axiom: relation has source
comment: Inverse of 'is rule associated with' object property.
label: está asociado con regla @es
label: est associé à la règle @fr
change note: In order to get a system of rolified Relation classes: modified the property chain axiom so that it now involves the new ruleRelation_role object property.
  date: 2023-11-08
change note: Added a new rdfs:label in Spanish.
  date: 2023-11-02
change note: Added a new rdfs:label in French.
  date: 2023-08-28
RiC-CM corresponding component: RiC-R062i ('is associated with rule' relation)

is author of
type: ObjectProperty
sub property of: is creator of
inverse of: has author
domain: Class
  union of: Group
  union of: Person
  union of: Position
range: Documento
property chain axiom: thing is target of relation
property chain axiom: has the role of the Authorship Relation
property chain axiom: relation has source
comment: Inverse of 'has author' object property.
label: es autor(a) de @es
label: est le responsable intellectuel de @fr
change note: In order to get a system of rolified Relation classes: modified the property chain axiom so that it now involves the new authorshipRelation_role object property.
  date: 2023-11-08
change note: Added a new rdfs:label in Spanish.
  date: 2023-11-02
change note: Added a new rdfs:label in French.
  date: 2023-08-28
change note: Created following the addition of RiC-R079 relation in RiC-CM 0.2
  date: 2020-12-29
RiC-CM corresponding component: RiC-R079i ('is author of' relation)

is authorizing agent in mandate relation
type: ObjectProperty
sub property of: thing is context of relation
inverse of: authorizing agent
domain: Agent
range: Mandate Relation
comment: Connects an Agent that assigns the Mandate, to a Mandate Relation.
label: es el agente autorizador en la relación normativa @es
label: est l’agent donnant l’autorisation dans la relation impliquant un mandat @fr
change note: Added a new rdfs:label in French and fixed the Spanish label.
  date: 2023-11-13
change note: Added a new rdfs:label in Spanish.
  date: 2023-11-02

is beginning date of
type: ObjectProperty
sub property of: is date associated with
inverse of: has beginning date
domain: Date
range: Thing
comment: Connects a Date to a Thing that came into existence on that Date.
label: es fecha de inicio de @es
label: est la date de début de @fr
change note: Added a new rdfs:label in Spanish.
  date: 2023-11-02
change note: Added a new rdfs:label in French.
  date: 2023-08-28
RiC-CM corresponding component: RiC-R069 ('is beginning date of' relation)

is birth date of
type: ObjectProperty
sub property of: is beginning date of
inverse of: has birth date
domain: Date
range: Person
comment: Connects a Date to a Person that was born on that Date.
label: es fecha de nacimiento de @es
label: est la date de naissance de @fr
change note: Added a new rdfs:label in Spanish.
  date: 2023-11-02
change note: Added a new rdfs:label in French.
  date: 2023-08-28
RiC-CM corresponding component: RiC-R070 ('is birth date of' relation)

is birth place of
type: ObjectProperty
sub property of: is place associated with agent
inverse of: has birth place
domain: Place
range: Person
comment: Connects a Place to a Person who was born in that Place.
label: es lugar de nacimiento de @es
label: est le lieu de naissance de @fr
change note: Added a new rdfs:label in Spanish.
  date: 2023-11-27
change note: Updated the description (rdfs:comment).
  date: 2023-11-12
change note: Fixed the range.
  date: 2023-10-26
change note: Added for RiC-O v1.0.
  date: 2023-10-19

is carrier type of
type: ObjectProperty
sub property of: is or was type of
inverse of: has carrier type
domain: Carrier Type
range: Instantiation
comment: Connects a Carrier Type to an Instantiation whose carrier it categorizes.
label: es tipo de soporte de @es
label: est le type de support de @fr
change note: Added a new rdfs:label in Spanish.
  date: 2023-11-02
change note: Added a new rdfs:label in French.
  date: 2023-08-28
change note: Changed the super property IRI.
  date: 2021-01-22

is child of
type: ObjectProperty
sub property of: has ancestor
inverse of: has child
domain: Person
range: Person
property chain axiom: thing is target of relation
property chain axiom: has the role of the Child Relation
property chain axiom: relation has source
comment: Inverse of 'has child' object property.
label: es hijo o hija de @es
label: est l’enfant de @fr
change note: In order to get a system of rolified Relation classes: modified the property chain axiom so that it now involves the new childRelation_role object property.
  date: 2023-11-08
change note: Added the property chain axiom so that this property is formally defined as a shortcut (the inverse property already was).
  date: 2023-11-07
change note: Added a new rdfs:label in Spanish.
  date: 2023-11-02
change note: Added a new rdfs:label in French.
  date: 2023-08-28
change note: changed the IRI and label (changed made in order to make RiC-O compliant with RiC-CM 0.2; the name of this property in RiC-O 0.1 was "hasParent").
  date: 2021-01-22
RiC-CM corresponding component: RiC-R018i ('is child of' relation)

is collector of
type: ObjectProperty
sub property of: is accumulator of
inverse of: has collector
domain: Agent
range: Class
  union of: Instantiation
  union of: Record Resource
comment: Inverse of 'has collector' object property.
label: collecte @fr
label: es coleccionista de @es
change note: Added a new rdfs:label in Spanish.
  date: 2023-11-02
change note: Added a new rdfs:label in French.
  date: 2023-08-28
change note:
  date: 2021-01-22
  value: changed the IRI, label, inverse property and super property IRI, text definition, domain (changed made in order to make RiC-O compliant with RiC-CM 0.2; the name of this property in RiC-O 0.1 was "collects").
RiC-CM corresponding component: RiC-R030i ('is collector of' relation)

is component of transitive
type: ObjectProperty
sub property of: is or was component of
sub property of: is part of transitive
type: TransitiveProperty
inverse of: has component transitive
domain: Instantiation
range: Instantiation
comment: Connects an Instantiation to another Instantiation of which it is, directly or indirectly, a component. This is a transitive relation.
label: es componente de transitivo @es
label: est un composant de transitif @fr
change note: Added a new rdfs:label in Spanish.
  date: 2023-11-27
change note: Updated the labels.
  date: 2023-11-12
change note: Object property added, along with its inverse property, in order to enable to express current partitive relations between instantiations (the past partitive relation also being added).
  date: 2023-09-08

is constituent of proxy
type: ObjectProperty
sub property of: is part of transitive
inverse of: proxy has constituent
domain: Class
  union of: Documento
  union of: Record Part
range: Proxy
property chain axiom: proxy is constituent of proxy transitive
comment: Connects a Record or Record Part to a Proxy of a Record or Record Part of which it is a constituent, directly or indirectly.
label: es elemento constitutivo del proxy @es
label: est le constituant du proxy @fr
change note: Added the French and Spanish labels.
  date: 2025-04-02
change note: Introduced in RiC-O 1.1.
  date: 2025-03-04

is constituent of transitive
type: ObjectProperty
sub property of: is or was constituent of
sub property of: is part of transitive
type: TransitiveProperty
inverse of: has constituent transitive
domain: Class
  union of: Documento
  union of: Record Part
range: Class
  union of: Documento
  union of: Record Part
property chain axiom: has proxy
property chain axiom: proxy in record
property chain axiom: is constituent of proxy
property chain axiom: proxy is constituent of
comment: Connects a Record or Record Part to another Record or Record Part of which it is a constituent, directly or indirectly. This is a transitive relation.
label: es elemento constitutivo de transitivo @es
label: est le constituant de transitif @fr
change note: Added two property chain axioms relating it to use of rico:Proxy.
  date: 2025-03-04
change note: Added a new rdfs:label in Spanish.
  date: 2023-11-27
change note: Updated the labels.
  date: 2023-11-12
change note: Added RecordPart to the range.
  date: 2023-10-26
change note:
  date: 2023-09-08
  value: Object property added, along with its inverse property, in order to enable to express current partitive relations between records and other records or record parts (the past partitive relation also being added).

is contained by transitive
type: ObjectProperty
sub property of: is or was contained by
sub property of: is part of transitive
type: TransitiveProperty
inverse of: contains transitive
domain: Place
range: Place
comment: Connects a Place to a Place that is, directly or indirectly, contained by it. This is a transitive relation.
label: está contenido en transitivo @es
label: est contenu par transitif @fr
change note: Added a new rdfs:label in Spanish.
  date: 2023-11-27
change note: Updated the labels.
  date: 2023-11-12
change note: Object property added, along with its inverse property, in order to enable to express current partitive relations between places (the past partitive relation also being added).
  date: 2023-09-08

is content type of
type: ObjectProperty
sub property of: is or was type of
inverse of: has content of type
domain: Content Type
range: Class
  union of: Documento
  union of: Record Part
comment: Connects a Content Type to a Record or Record Part whose content it categorizes.
label: es tipo de contenido de @es
label: est le type de contenu de @fr
change note: Added a new rdfs:label in Spanish.
  date: 2023-11-02
change note: Added a new rdfs:label in French.
  date: 2023-08-28
change note: changed the text definition and super property IRI.
  date: 2021-01-22

is copy of
type: ObjectProperty
sub property of: follows in time
sub property of: has genetic link to record resource
inverse of: has copy
domain: Record Resource
range: Record Resource
comment: Inverse of 'has copy' object property.
label: es copia de @es
label: est la copie de @fr
change note: Added a new rdfs:label in Spanish.
  date: 2023-11-02
change note: Added a new rdfs:label in French.
  date: 2023-08-28
RiC-CM corresponding component: RiC-R012i ('is copy of' relation)

is creation date of
type: ObjectProperty
sub property of: is beginning date of
sub property of: is organic provenance date of
inverse of: has creation date
domain: Date
range: Class
  union of: Instantiation
  union of: Record Resource
property chain axiom: is date associated with Relation
property chain axiom: has the role of the Creation Relation
property chain axiom: relation has source
comment: Connects a Date to a Record Resource or Instantiation that was or will be created at this Date.
label: es fecha de creación de @es
label: est la date de création de @fr
change note: Changed definition (added "or will be").
  date: 2025-02-19
change note: Connect to CreationRelation via a sub-property chain, and make a sub-property of the new 'isOrganicProvenanceDateOf' object property.
  date: 2024-12-19
change note: Added a new rdfs:label in Spanish.
  date: 2023-11-27
change note: Aligned with RiC-CM 1.0: updated the skos:scopeNote.
  date: 2023-11-12
change note: Added the French label
  date: 2023-10-12
change note: Added in RiC-O 1.0.
  date: 2023-09-22
scope note: When used for a Record Set (e.g. a file), it is the creation date of the Record Set itself rather than the creation date of the members of the Record Set. To record the creation date of members of the Record Set, use 'is or was creation date of all members of', 'is or was creation date of most members of’ or 'is or was creation date of some members of’.
RiC-CM corresponding component: RiC-R080 ('is creation date of' relation)

is creator of
type: ObjectProperty
sub property of: is organic provenance of
inverse of: has creator
domain: Agent
range: Class
  union of: Instantiation
  union of: Record Resource
property chain axiom: thing is target of relation
property chain axiom: has the role of the Creation Relation
property chain axiom: relation has source
comment: Inverse of 'has creator' object property.
label: es creador(a) de @es
label: est le créateur de @fr
change note: In order to get a system of rolified Relation classes: modified the property chain axiom so that it now involves the new creationRelation_role object property.
  date: 2023-11-08
change note: Added a new rdfs:label in Spanish.
  date: 2023-11-02
change note: Added a new rdfs:label in French.
  date: 2023-08-28
change note: change the inverse property IRI.
  date: 2021-01-22
RiC-CM corresponding component: RiC-R027i ('is creator of 'relation')

is date associated with
type: ObjectProperty
sub property of: is related to
inverse of: is associated with date
domain: Date
range: Thing
comment: Connects a Date to a Thing with whose existence and lifecycle the Date is associated.
label: es fecha asociada con @es
label: est une date associée a @fr
change note: Aligned with RiC-CM 1.0: updated the description (rdfs:comment), skos:scopeNote.
  date: 2023-11-12
change note: Added a new rdfs:label in Spanish.
  date: 2023-11-02
change note: Added a new rdfs:label in French.
  date: 2023-08-28
scope note: Use to connect a date and an entity only if it is not possible to specify a narrower date relation, for example, is beginning date of.
RiC-CM corresponding component: RiC-R068 ('is date associated with' relation)

is date associated with Relation
type: ObjectProperty
sub property of: is date associated with
sub property of: thing is context of relation
inverse of: relation has date
domain: Date
range: Relation
comment: Connects a Date to an n-ary Relation.
label: es fecha asociada con la relación @es
label: est une date associée à la relation @fr
change note: Added French and Spanish labels; fixed the first rdfs:subPropertyOf and the rdfs:domain.
  date: 2025-03-13
change note: Added in RiC-O 1.1.
  date: 2024-12-19

is date of occurrence of
type: ObjectProperty
sub property of: is associated with event
sub property of: is date associated with
inverse of: occurred at date
domain: Date
range: Event
comment: Connects a Date to an Event that occurred at this Date. An event or activity can be recurrent, which implies that one single event can be related to several dates.
label: es fecha de ocurrencia de @es
label: est la date d'occurrence de @fr
change note: Added a new rdfs:label in Spanish.
  date: 2023-11-27
change note: Made this property a subproperty of isAssociatedWithEvent
  date: 2023-10-17
change note: Renamed the property to correct a spelling mistake. Also corrected the annotations when necessary.
  date: 2023-10-13
change note: Added the property
  date: 2023-10-12
RiC-CM corresponding component: RiC-R084 ('is date of occurrence of' relation)

is date type of
type: ObjectProperty
sub property of: is or was type of
inverse of: has date type
domain: Date Type
range: Date
comment: Connects a Date Type to a Date that it categorizes.
label: es tipo de fecha de @es
label: est le type de date de @fr
change note: Added a new rdfs:label in Spanish.
  date: 2023-11-27
change note: Added a rdfs:comment and a French rdfs:label.
  date: 2023-10-10
change note: Added in RiC-O 1.0.
  date: 2023-09-22

is death date of
type: ObjectProperty
sub property of: is end date of
inverse of: has death date
domain: Date
range: Person
comment: Connects a Date to a Person who died on that Date.
label: es fecha de muerte de @es
label: est la date de décès de @fr
change note: Added a new rdfs:label in Spanish.
  date: 2023-11-02
change note: Added a new rdfs:label in French.
  date: 2023-08-28
RiC-CM corresponding component: RiC-R072 ('is death date of' relation)

is death place of
type: ObjectProperty
sub property of: is place associated with agent
inverse of: has death place
domain: Place
range: Person
comment: Connects a Place to a Person who died in that Place.
label: es lugar de muerte de @es
label: est le lieu de décès de @fr
change note: Added a new rdfs:label in Spanish.
  date: 2023-11-27
change note: Updated the description (rdfs:comment).
  date: 2023-11-12
change note: Fixed the range and the French label of the property.
  date: 2023-10-26
change note: Property added to RiC-0 1.0
  date: 2023-10-19

is derivation date of
type: ObjectProperty
sub property of: is date associated with
inverse of: has derivation date
domain: Date
range: Instantiation
property chain axiom: is date associated with Relation
property chain axiom: has the role of the Derivation Relation
property chain axiom: relation has source
comment: Connects a Date to an Instantiation from which a new Instantiation was or will be derived at that Date.
label: es fecha de derivación de @es
label: est la date de dérivation de @fr
change note: Added the property chain axiom.
  date: 2025-03-13
change note: Added in RiC-O 1.1.
  date: 2025-03-01

is destruction date of
type: ObjectProperty
sub property of: is end date of
inverse of: has destruction date
domain: Date
range: Class
  union of: Instantiation
  union of: Record Resource
comment: Connects a Date to a Record Resource or Instantiation that was or will be destructed at that Date.
label: es fecha de destrucción de @es
label: est la date de destruction de @fr
change note: Changed definition (added "or will be") and range.
  date: 2025-02-19
change note: Added a new rdfs:label in Spanish.
  date: 2023-11-27
change note: Added a rdfs:comment; same to the inverse property.
  date: 2023-10-14
change note: Renamed deletion into destruction.
  date: 2023-10-12
change note: Added in RiC-O 1.0.
  date: 2023-09-22

is direct component of
type: ObjectProperty
sub property of: is component of transitive
sub property of: is direct part of
inverse of: has direct component
domain: Instantiation
range: Instantiation
comment: Connects an Instantiation to another Instantiation of which it is a direct component.
label: es componente directo de @es
label: est le composant direct de @fr
change note: Added a new rdfs:label in Spanish.
  date: 2023-11-27
change note: Updated the labels.
  date: 2023-11-12
change note:
  date: 2023-09-08
  change note: Object property added, along with its inverse property, in order to enable to express current, direct, partitive relations between instantiations (the possibly indirect, transitive relation, superproperty of this one, being also added).

is direct constituent of
type: ObjectProperty
sub property of: is constituent of transitive
sub property of: is direct part of
inverse of: has direct constituent
domain: Class
  union of: Documento
  union of: Record Part
range: Class
  union of: Documento
  union of: Record Part
property chain axiom: is direct constituent of proxy
property chain axiom: proxy for
comment: Connects a Record or Record Part to another Record or Record Part of which it is a direct constituent.
label: es elemento constitutivo directo de @es
label: est un constituant direct de @fr
change note: Added a property chain axiom relating it to use of rico:Proxy.
  date: 2025-03-04
change note: Added a new rdfs:label in Spanish.
  date: 2023-11-27
change note: Updated the labels.
  date: 2023-11-12
change note: Added RecordPart to the range.
  date: 2023-10-26
change note:
  date: 2023-09-08
  value: Object property added, along with its inverse property, in order to enable to express current, direct, partitive relations between records and other records or record parts (the possibly indirect, transitive relation, superproperty of this one, being also added).

is direct constituent of proxy
type: ObjectProperty
sub property of: is constituent of proxy
sub property of: is direct part of
inverse of: proxy has direct constituent
domain: Class
  union of: Documento
  union of: Record Part
range: Proxy
comment: Connects a Record or Record Part to a Proxy of a Record or Record Part which it is a direct constituent of.
label: es elemento constitutivo directo del proxy @es
label: est un constituant direct du proxy @fr
change note: Added the French and Spanish labels.
  date: 2025-04-02
change note: Introduced in RiC-O 1.1.
  date: 2025-03-04

is direct part of
type: ObjectProperty
sub property of: is part of transitive
inverse of: has direct part
domain: Thing
range: Thing
comment: Connects a Thing to a Thing of which it is direct constitutive or component part.
label: es parte directa de @es
label: fait directement partie de @fr
change note: Added a new rdfs:label in Spanish.
  date: 2023-11-27
change note: Updated the labels.
  date: 2023-11-12
change note:
  date: 2023-07-12
  value: Object property added, along with its inverse property, in order to enable to express current, direct, partitive relations between things (the possibly indirect, transitive relation, superproperty of this one, being also added).
scope note: To be used only when the current partitive relation is direct, without any intermediate node between the related things.

is direct subdivision of
type: ObjectProperty
sub property of: is direct part of
sub property of: is direct subordinate to
sub property of: is subdivision of transitive
inverse of: has direct subdivision
domain: Group
range: Group
comment: Connects a Group to the Group it is a direct subdivision of.
label: es subdivisión directa de @es
label: est la subdivision directe de @fr
change note: Added a new rdfs:label in Spanish.
  date: 2023-11-27
change note: Updated the labels.
  date: 2023-11-12
change note:
  date: 2023-09-08
  value: Object property added, along with its inverse property, in order to enable to express current, direct, partitive relations between groups (the possibly indirect, transitive relation, superproperty of this one, being also added).

is direct subevent of
type: ObjectProperty
sub property of: is direct part of
sub property of: is subevent of transitive
inverse of: has direct subevent
domain: Event
range: Event
comment: Connects an ongoing Event to the Event it is a direct part of.
label: es parte directa de evento de @es
label: est un événement constituant directement l’événement @fr
change note: Added a new rdfs:label in Spanish.
  date: 2023-11-27
change note: Updated the labels.
  date: 2023-11-12
change note:
  date: 2023-09-08
  value: Object property added, along with its inverse property, in order to enable to express current, direct, partitive relations between ongoing events (the possibly indirect, transitive relation, superproperty of this one, being also added).

is direct subordinate to
type: ObjectProperty
sub property of: is subordinate to transitive
inverse of: has direct subordinate
domain: Agent
range: Agent
comment: Connects an Agent to an Agent that is directly hierarchically superior.
label: está directamente subordinado(a) a @es
label: est directement subalterne de @fr
change note: Added a new rdfs:label in Spanish.
  date: 2023-11-27
change note: Updated the labels.
  date: 2023-11-12
change note:
  date: 2023-09-08
  value: Object property added, along with its inverse property, in order to enable to express current, direct, subordination relations between agents (the possibly indirect, transitive relation, superproperty of this one, being also added).

is directly contained by
type: ObjectProperty
sub property of: is contained by transitive
sub property of: is direct part of
inverse of: contains directly
domain: Place
range: Place
comment: Connects a Place to a Place that directly contains it.
label: está directamente contenido en @es
label: est directement contenu par @fr
change note: Added a new rdfs:label in Spanish.
  date: 2023-11-27
change note: Updated the labels.
  date: 2023-11-12
change note:
  date: 2023-09-08
  value: Object property added, along with its inverse property, in order to enable to express current, direct, partitive relations between places (the possibly indirect, transitive relation, superproperty of this one, being also added).

is directly included in
type: ObjectProperty
sub property of: is direct part of
sub property of: is included in transitive
inverse of: directly includes
domain: Class
  union of: Documento
  union of: Record Set
range: Record Set
comment: Connects a Record to a Record or Record Set in which it is directly included.
label: está directamente incluido en @es
label: est directement inclus dans @fr
change note: Added a new rdfs:label in Spanish.
  date: 2023-11-27
change note: Updated the labels.
  date: 2023-11-12
change note:
  date: 2023-09-08
  value: Object property added, along with its inverse property, in order to enable to express current, direct, partitive relations between Record Sets and their members (the possibly indirect, transitive relation, superproperty of this one, being also added).

is directly included in proxy
type: ObjectProperty
sub property of: is direct part of
sub property of: is included in proxy
inverse of: proxy directly includes
domain: Class
  union of: Documento
  union of: Record Set
range: Proxy
comment: Connects a Record or Record Set to a Proxy of a Record Set which it is directly included in.
label: está directamente incluido en el proxy @es
label: est directement inclus dans le proxy @fr
change note: Added the French and Spanish labels.
  date: 2025-04-02
change note: Introduced in RiC-O 1.1.
  date: 2025-03-04

is documentary form type of
type: ObjectProperty
sub property of: is or was type of
inverse of: has documentary form type
domain: Documentary Form Type
range: Class
  union of: Documento
  union of: Record Part
comment: Connects a Documentary Form Type to a Record or Record Part that it categorizes.
label: es tipo documental de @es
label: est le type de document de @fr
change note: Added a new rdfs:label in Spanish.
  date: 2023-11-02
change note: Added a new rdfs:label in French.
  date: 2023-08-28
change note: changed the superproperty IRI.
  date: 2021-01-22

is draft of
type: ObjectProperty
sub property of: has genetic link to record resource
sub property of: precedes in time
inverse of: has draft
domain: Class
  union of: Documento
  union of: Record Part
range: Class
  union of: Documento
  union of: Record Part
comment: Connects a draft to the final version of a Record.
label: es borrador de @es
label: est l’ébauche de @fr
change note: Aligned with RiC-CM 1.0: updated the skos:scopeNote.
  date: 2023-11-12
change note: Added a new rdfs:label in Spanish.
  date: 2023-11-02
change note: Added a new rdfs:label in French.
  date: 2023-08-28
scope note: There may be zero to many intermediate records, ignored or unknown, between the two connected Records.
RiC-CM corresponding component: RiC-R011 ('is draft of' relation)

is end date of
type: ObjectProperty
sub property of: is date associated with
inverse of: has end date
domain: Date
range: Thing
comment: Connects a Date to a Thing whose existence ended on that Date.
label: es fecha final de @es
label: est la date de fin de @fr
change note: Added a new rdfs:label in Spanish.
  date: 2023-11-02
change note: Added a new rdfs:label in French.
  date: 2023-08-28
RiC-CM corresponding component: RiC-R071 ('is end date of' relation)

is equivalent to
type: ObjectProperty
sub property of: is related to
type: SymmetricProperty
domain: Thing
range: Thing
comment: Connects two Things that are considered equivalent.
label: equivale a @es
label: est l’équivalent de @fr
change note: Added a new rdfs:label in Spanish.
  date: 2023-11-02
change note: Added a new rdfs:label in French.
  date: 2023-08-28

is event associated with
type: ObjectProperty
sub property of: is related to
inverse of: is associated with event
domain: Event
range: Thing
property chain axiom: thing is source of relation
property chain axiom: has the role of the Event Relation
property chain axiom: relation has target
comment: Connects an Event to a Thing that is associated with the existence and lifecycle of the Event.
label: es evento asociado con @es
label: est un événement associé a @fr
change note: Aligned with RiC-CM 1.0: updated the skos:scopeNote.
  date: 2023-11-12
change note: In order to get a system of rolified Relation classes: modified the property chain axiom so that it now involves the new eventRelation_role object property.
  date: 2023-11-08
change note: Added a new rdfs:label in Spanish.
  date: 2023-11-02
change note: Added a new rdfs:label in French.
  date: 2023-08-28
scope note: Use to connect an Event and an entity only if it is not possible to specify a narrower Event relation, for example has or had participant.
RiC-CM corresponding component: RiC-R057 ('is event associated with' relation)

is event type of
type: ObjectProperty
sub property of: is or was type of
inverse of: has event type
domain: Event Type
range: Event
comment: Connects an Event Type to an Event that it categorizes.
label: es tipo de evento de @es
label: est le type d’événement de @fr
change note: Fixed typo in rdfs:comment
  date: 2024-03-15
change note: Added a new rdfs:label in Spanish.
  date: 2023-11-02
change note: Added a new rdfs:label in French.
  date: 2023-08-28
change note: changed the superproperty IRI.
  date: 2021-01-22

is evidenced by
type: ObjectProperty
sub property of: relation connects
inverse of: evidences
domain: Relation
range: Record Resource
comment: Connects a Relation to a Record Resource that is used for proving is existence or describing it.
label: est attestée par @fr
label: se evidencia en @es
change note:
  date: 2023-12-27
  value: Renamed the object property (was 'has source') and reduced its domain to Relation (the domain was the union of Record Resource and Relation) and its range to Record Resource (the range was the union of Agent and Record Resource). Consequently updated the superproperty, the labels, and added a rico:RiCCMCorrespondingComponent. Same for the inverse object property.
change note: Added a new rdfs:label in Spanish.
  date: 2023-11-02
change note: Added a new rdfs:label in French.
  date: 2023-08-28
RiC-CM corresponding component: Object property implementation of RiC-RA05 (Source of Relation attribute).

is extent of
type: ObjectProperty
sub property of: is related to
inverse of: has extent
domain: Extent
range: Thing
comment: Connects an Extent to a Thing
label: es extensión de @es
label: est la mesure de @fr
change note: Fixed the range.
  date: 2023-11-08
change note: Added a new rdfs:label in Spanish.
  date: 2023-11-02
change note: Added a new rdfs:label in French; added an xml:lang attribute to the rdfs:comment.
  date: 2023-08-28
change note: Changed the range (was Instantiation or RecordResource) to Thing ; changed the definition accordingly
  date: 2023-08-28
change note: Object property created along with the Extent class and its subclasses, in order to provide methods for handling extent accurately.
  date: 2020-10-28

is extent type of
type: ObjectProperty
sub property of: is or was type of
inverse of: has extent type
domain: Extent Type
range: Extent
comment: Connects an Extent Type to an Extent that it categorizes.
label: es tipo de extensión de @es
label: est le type de mesure de @fr
change note: Added a new rdfs:label in Spanish.
  date: 2023-11-02
change note: Added a new rdfs:label in French.
  date: 2023-08-28
change note: Added a rdfs:comment.
  date: 2020-11-21
change note: Object property added along with the Extent Type class.
  date: 2020-11-01

is family type of
type: ObjectProperty
sub property of: is or was type of
inverse of: has family type
domain: Family Type
range: Family
comment: Connects a Family Type to a Family that it categorizes.
label: es tipo de familia de @es
label: est le type de famille de @fr
change note: Fixed typo in rdfs:comment
  date: 2024-03-15
change note: Added a new rdfs:label in Spanish.
  date: 2023-11-02
change note: Added a new rdfs:label in French.
  date: 2023-08-28
change note: changed the superproperty IRI.
  date: 2021-01-22

is from use date of
type: ObjectProperty
sub property of: is beginning date of
inverse of: was used from date
domain: Date
range: Appellation
comment: Connects a Date to an Appellation, when it is the date at which the Appellation was first used.
label: es fecha desde la que se usa de @es
label: est la date à partir de laquelle est utilisé @fr
change note: Added a new rdfs:label in Spanish.
  date: 2023-11-02
change note: Made this property subPropertyOf isBeginningDateOf.
  date: 2023-10-19
change note: Added a new rdfs:label in French.
  date: 2023-08-28

is functionally equivalent to
type: ObjectProperty
sub property of: is equivalent to
sub property of: is instantiation associated with instantiation
type: SymmetricProperty
domain: Instantiation
range: Instantiation
property chain axiom: thing is connected to relation
property chain axiom: has the role of the Functional Equivalence Relation
property chain axiom: relation connects
comment: Connects two Instantiations which may be considered as equivalent. This relation is symmetric.
label: equivale funcionalmente a @es
label: est fonctionnellement équivalente à @fr
change note: In order to get a system of rolified Relation classes: modified the property chain axiom so that it now involves the new functionalEquivalenceRelation_role object property.
  date: 2023-11-08
change note: Added a new rdfs:label in Spanish.
  date: 2023-11-02
change note: Added a new rdfs:label in French.
  date: 2023-08-28
change note: changed the scope note.
  date: 2021-01-22
scope note: Two Instantiations, from some point of view, may be considered as equivalent. This equivalence is usually based upon the fact that the Instantiations have at least the same intellectual content (they instantiate the same Record Resource).
RiC-CM corresponding component: RiC-R035 ('is functionally equivalent to' relation)

is identifier type of
type: ObjectProperty
sub property of: is or was type of
inverse of: has identifier type
domain: Identifier Type
range: Identifier
comment: Connects an Identifier Type and an Identifier that it categorizes.
label: es tipo de identificador de @es
label: est le type d’identifiant de @fr
change note: Added a new rdfs:label in Spanish.
  date: 2023-11-02
change note: Added a new rdfs:label in French.
  date: 2023-08-28
change note: changed the superproperty IRI.
  date: 2021-01-22
change note: Object property added along with IdentifierType class and hasIdentifierType object property.
  date: 2020-10-19

is included in proxy
type: ObjectProperty
sub property of: is part of transitive
inverse of: proxy includes
domain: Class
  union of: Documento
  union of: Record Set
range: Proxy
property chain axiom: proxy is included in proxy transitive
comment: Connects a Record or Record Set to a Proxy of a Record Set which it is included in, directly or indirectly.
label: está incluido en el proxy @es
label: est inclus dans le proxy @fr
change note: Added the French and Spanish labels.
  date: 2025-04-02
change note: Introduced in RiC-O 1.1.
  date: 2025-03-04

is included in transitive
type: ObjectProperty
sub property of: is or was included in
sub property of: is part of transitive
type: TransitiveProperty
inverse of: includes transitive
domain: Class
  union of: Documento
  union of: Record Set
range: Record Set
property chain axiom: has proxy
property chain axiom: proxy in record set
property chain axiom: is included in proxy
property chain axiom: proxy is included in
comment: Connects a Record to a Record or Record Set in which it is directly or indirectly included. This is a transitive relation.
label: está incluido en transitivo @es
label: est inclus dans transitif @fr
change note: Added two property chain axioms relating it to use of rico:Proxy.
  date: 2025-03-04
change note: Added a new rdfs:label in Spanish.
  date: 2023-11-27
change note: Added a French label.
  date: 2023-11-13
change note: Object property added, along with its inverse property, in order to enable to express current partitive relations between Record Sets and their members (the past partitive relation also being added).
  date: 2023-09-08

is instantiation associated with instantiation
type: ObjectProperty
sub property of: is related to
type: SymmetricProperty
domain: Instantiation
range: Instantiation
property chain axiom: thing is connected to relation
property chain axiom: has the role of the Instantiation to Instantiation Relation
property chain axiom: relation connects
comment: Connects two Instantiations. This relation is symmetric.
label: est associée à l’instanciation @fr
label: se asocia con la instanciación @es
change note: Aligned with RiC-CM 1.0: updated the description (rdfs:comment), skos:scopeNote.
  date: 2023-11-12
change note: In order to get a system of rolified Relation classes: modified the property chain axiom so that it now involves the new instantiationToInstantiationRelation_role object property.
  date: 2023-11-08
change note: Added a new rdfs:label in Spanish.
  date: 2023-11-02
change note: Added a new rdfs:label in French.
  date: 2023-08-28
scope note: Use only if it is not possible to specify a narrower Instantiation to Instantiation relation, for example is functionally equivalent to.
RiC-CM corresponding component: RiC-R034 ('is instantiation associated with instantiation' relation)

is last update date of
type: ObjectProperty
sub property of: is modification date of
inverse of: was last updated at date
domain: Date
range: Thing
comment: Connects a Date and a Thing that was last modified at this Date.
label: es fecha de última actualización de @es
label: est la date de dernière mise à jour de @fr
change note: Added a new rdfs:label in Spanish.
  date: 2023-11-02
change note: Added a new rdfs:label in French.
  date: 2023-08-28

is main thing represented by content of
type: ObjectProperty
sub property of: is or was main subject of
sub property of: is represented by content of
inverse of: has content which mainly represents
domain: Thing
range: Class
  union of: Documento
  union of: Record Part
comment: Inverse of 'has content which mainly represents' object property.
label: es lo principal representado por el contenido de @es
label: est la chose principale représentée par le contenu de @fr
change note: Introduced in RiC-O 1.1.
  date: 2025-04-04

is migration date of
type: ObjectProperty
sub property of: is derivation date of
inverse of: has migration date
domain: Date
range: Instantiation
property chain axiom: is date associated with Relation
property chain axiom: has the role of the Migration Relation
property chain axiom: relation has source
comment: Connects a Date to an Instantiation that was or will be migrated at that Date.
label: es fecha de migración de @es
label: est la date de migration de @fr
change note: Added the property chain axiom.
  date: 2025-03-13
change note: Removed 'Record Resource' from the definition and made this property a subproperty of the new 'isDerivationDateOf' property.
  date: 2025-03-01
change note: Added in RiC-O 1.1.
  date: 2025-02-19

is modification date of
type: ObjectProperty
sub property of: is date associated with
inverse of: has modification date
domain: Date
range: Thing
comment: Connects a Date to a Thing that was modified on that Date.
label: es fecha de modificación de @es
label: est une date de modification de @fr
change note: Added a new rdfs:label in Spanish.
  date: 2023-11-02
change note: Added a new rdfs:label in French.
  date: 2023-08-28
RiC-CM corresponding component: RiC-R073 ('is modification date of' relation)

is or was accumulation date of all members of
type: ObjectProperty
sub property of: is date associated with
inverse of: has or had all members with accumulation date
domain: Date
range: Record Set
comment: Connects a Date to a Record Set all of whose present or past members were or will be accumulated at this Date.
label: es o era fecha de acumulación de todos los miembros de @es
label: est ou a été la date de accumulation de tous les membres de @fr
change note: Changed definition (added "or will be").
  date: 2025-02-19
change note: Added in RiC-O 1.1.
  date: 2024-10-04

is or was accumulation date of most members of
type: ObjectProperty
sub property of: is or was accumulation date of some members of
inverse of: has or had most members with accumulation date
domain: Date
range: Record Set
comment: Connects a Date to a Record Set most of whose present or past members were or will be accumulated at this Date.
label: es o era fecha de acumulación de la mayoría de los miembros de @es
label: est ou a été la date d'accumulation de la plupart des membres de @fr
change note: Changed definition (added "or will be").
  date: 2025-02-19
change note: Added in RiC-O 1.1.
  date: 2024-10-04
scope note: To be used for specifying a bulk date, i.e. the predominant date of the members of the record set.

is or was accumulation date of some members of
type: ObjectProperty
sub property of: is date associated with
inverse of: has or had some members with accumulation date
domain: Date
range: Record Set
comment: Connects a Date to a Record Set some of whose present or past members were or will be accumulated at this Date.
label: es o era fecha de acumulación de algunos miembros de @es
label: est ou a été la date d'accumulation de certains membres de @fr
change note: Changed definition (added "or will be").
  date: 2025-02-19
change note: Added in RiC-O 1.1.
  date: 2024-10-04

is or was active at date
type: ObjectProperty
sub property of: is associated with date
inverse of: is or was date of activity of
domain: Agent
range: Date
property chain axiom: thing is target of relation
property chain axiom: has the role of the Performance Relation
property chain axiom: relation has date
comment: Inverse of 'is or was activity date of' object property.
label: está o estuvo activo en la fecha @es
label: est ou a été actif à la date @fr
change note: Adjusted the rdfs:comment and added French and Spanish labels.
  date: 2025-04-03
change note: Introduced in RiC-O 1.1.
  date: 2025-03-06

is or was date of activity of
type: ObjectProperty
sub property of: is date associated with
inverse of: is or was active at date
domain: Date
range: Agent
property chain axiom: is date associated with Relation
property chain axiom: has the role of the Performance Relation
property chain axiom: relation has target
comment: Connects a Date to an Agent that is or was active at that Date.
label: es o era fecha de actividad de @es
label: est ou a été la date d’activité de @fr
change note: Renamed the property, changed its rdfs:comment, added the property chain axiom and French and Spanish labels.
  date: 2025-04-03
change note: Introduced in RiC-O 1.1.
  date: 2025-03-06

is or was adjacent to
type: ObjectProperty
sub property of: is associated with place
sub property of: is place associated with
type: SymmetricProperty
domain: Place
range: Place
comment: Connects two Places that are or were geographically adjacent. This relation is symmetric.
label: es o era un lugar contiguo a @es
label: est ou a été adjacent à @fr
change note: Aligned with RiC-CM 1.0: updated the description (rdfs:comment), skos:scopeNote.
  date: 2023-11-12
change note: Added a new rdfs:label in Spanish.
  date: 2023-11-02
change note: Added a new rdfs:label in French.
  date: 2023-08-28
change note: changed the IRI, label, textual definition (changed made in order to make RiC-O compliant with RiC-CM 0.2; the name of this property in RiC-O 0.1 was "isAdjacentTo").
  date: 2021-01-22
scope note: Use for connecting two adjacent geographical or administrative regions.
RiC-CM corresponding component: RiC-R077 ('is or was adjacent to' relation)

is or was affected by
type: ObjectProperty
sub property of: is or was participant in
inverse of: affects or affected
domain: Thing
range: Event
comment: Inverse of 'affects or affected' object property.
label: es o era afectado por @es
label: est ou a été affecté par @fr
change note: Added a new rdfs:label in Spanish.
  date: 2023-11-02
change note: Added a new rdfs:label in French.
  date: 2023-08-28
change note:
  date: 2021-01-22
  value: changed the IRI, label, inverse property IRI, text definition and corresponding CM component (changed made in order to make RiC-O compliant with RiC-CM 0.2; the name of this property in RiC-O 0.1 was "affectedBy").
RiC-CM corresponding component: RiC-R059i ('is or was affected by' relation)

is or was agent name of
type: ObjectProperty
sub property of: is or was name of
inverse of: has or had agent name
domain: Agent Name
range: Agent
comment: Connects an Agent Name to an Agent it designates or designated.
label: es o era el nombre de agente de @es
label: est ou a été le nom de @fr
change note: Added a new rdfs:label in Spanish.
  date: 2023-11-02
change note: Added a new rdfs:label in French.
  date: 2023-08-28
change note: changed the IRI, label, inverse property IRI, textual definition (the name of this property in RiC-O 0.1 was "isAgentNameOf").
  date: 2021-01-22

is or was analogue instantiation of
type: ObjectProperty
sub property of: is or was instantiation of
inverse of: has or had analogue instantiation
domain: Instantiation
range: Record Resource
comment: Inverse of 'has or had analogue instantiation' object property.
label: es or era instanciación analogica de @es
label: est ou a été une instanciation analogique de @fr
change note: Fixed a typo in the French label.
  date: 2023-12-30
change note: Added a new rdfs:label in Spanish.
  date: 2023-11-27
change note: Added the property.
  date: 2023-08-29

is or was appellation of
type: ObjectProperty
sub property of: is related to
inverse of: has or had appellation
domain: Appellation
range: Thing
property chain axiom: thing is source of relation
property chain axiom: has the role of the Appellation Relation
property chain axiom: relation has target
comment: Connects an Appellation to a Thing that it designates or designated.
label: es o era la denominación de @es
label: est ou a été l’appellation de @fr
change note: In order to get a system of rolified Relation classes: modified the property chain axiom so that it now involves the new appellationRelation_role object property.
  date: 2023-11-08
change note: Added the property chain axiom so that this property is formally defined as a shortcut (the inverse property already was).
  date: 2023-11-07
change note: Added a new rdfs:label in Spanish.
  date: 2023-11-02
change note: Added a new rdfs:label in French.
  date: 2023-08-28
change note: changed the IRI, label, inverse property IRI, text definition (the name of this property in RiC-O 0.1 was "isAppellationOf").
  date: 2021-01-22

is or was attended by student
type: ObjectProperty
sub property of: has or had member
inverse of: studies or studied at
domain: Group
range: Person
property chain axiom: thing is source of relation
property chain axiom: has the role of the Study At Relation
property chain axiom: relation has target
comment: Inverse of 'studies or studied at' object property.
label: es o fue atendido por el estudiante @es
label: est ou a été fréquenté par l’étudiant @fr
change note: Added the French and Spanish labels.
  date: 2024-12-23
change note: Added in RiC-O 1.1.
  date: 2024-12-19

is or was component of
type: ObjectProperty
sub property of: is instantiation associated with instantiation
sub property of: is or was part of
inverse of: has or had component
domain: Instantiation
range: Instantiation
comment: Inverse of 'has or had component' object property.
label: es o era componente de @es
label: est ou a été un composant de @fr
change note: Added a new rdfs:label in Spanish.
  date: 2023-11-02
change note: Added a new rdfs:label in French.
  date: 2023-08-28
change note: changed the IRI, label, inverse property IRI, text definition (changed made in order to make RiC-O compliant with RiC-CM 0.2; the name of this property in RiC-O 0.1 was "isComponentOf").
  date: 2021-01-22
RiC-CM corresponding component: RiC-R004i ('is or was component of' relation)

is or was constituent of
type: ObjectProperty
sub property of: is or was part of
sub property of: is record resource associated with record resource
inverse of: has or had constituent
domain: Class
  union of: Documento
  union of: Record Part
range: Class
  union of: Documento
  union of: Record Part
comment: Inverse of 'has or had constituent' object property.
label: es o era elemento constitutivo de @es
label: est ou a été un constituant de @fr
change note: Added a new rdfs:label in Spanish.
  date: 2023-11-02
change note: Added RecordPart to the range.
  date: 2023-10-26
change note: Added a new rdfs:label in French.
  date: 2023-08-28
change note: changed the IRI, label, inverse property IRI, text definition (changed made in order to make RiC-O compliant with RiC-CM 0.2; the name of this property in RiC-O 0.1 was "isConstituentOf").
  date: 2021-01-22
RiC-CM corresponding component: RiC-R003i ('is or was constituent of' relation)

is or was contained by
type: ObjectProperty
sub property of: is associated with place
sub property of: is or was part of
sub property of: is place associated with
inverse of: contains or contained
domain: Place
range: Place
comment: Inverse of 'contains or contained' object property.
label: está o estaba contenido en @es
label: est ou a été contenu par @fr
change note: Added a new rdfs:label in Spanish.
  date: 2023-11-02
change note: Added a new rdfs:label in French.
  date: 2023-08-28
change note:
  date: 2021-01-22
  value: changed the IRI, label, inverse property IRI, text definition, corresponding CM component name (changed made in order to make RiC-O compliant with RiC-CM 0.2; the name of this property in RiC-O 0.1 was "containedBy").
RiC-CM corresponding component: RiC-R007i ('is or was contained by' relation)

is or was content type of all members of
type: ObjectProperty
sub property of: is or was type of all members of
inverse of: has or had all members with content type
domain: Content Type
range: Record Set
comment: Connects a Content Type and a Record Set whose all past or present Record or Record Part members have that Content Type.
label: es o era tipo de contenido de todos los miembros de @es
label: est ou a été le type de contenu de tous les membres de @fr
change note: Added a new rdfs:label in Spanish.
  date: 2023-11-02
change note: Added a new rdfs:label in French.
  date: 2023-08-28
change note:
  date: 2020-12-28
  value: Object property added for handling the case where a Record Set is described as having all or some members that belong to some category (see RiC-CM 0.2 attributes section, #4.4 on Record Set, Record and Record Part attributes).

is or was content type of some members of
type: ObjectProperty
sub property of: is or was type of some members of
inverse of: has or had some members with content type
domain: Content Type
range: Record Set
comment: Connects a Content Type and a Record Set whose some past or present Record or Record Part members have that Content Type.
label: es o era tipo de contenido de algunos miembros de @es
label: est ou a été le type de contenu de certains membres de @fr
change note: Added a new rdfs:label in Spanish.
  date: 2023-11-02
change note: Added a new rdfs:label in French.
  date: 2023-08-28
change note:
  date: 2020-12-28
  value: Object property added for handling the case where a Record Set is described as having all or some members that belong to some category (see RiC-CM 0.2 attributes section, #4.4 on Record Set, Record and Record Part attributes).

is or was controller of
type: ObjectProperty
sub property of: has or had authority over
sub property of: has or had subordinate
inverse of: has or had controller
domain: Agent
range: Agent
property chain axiom: thing is source of relation
property chain axiom: has the role of the Agent Control Relation
property chain axiom: relation has target
comment: Connects an Agent to another Agent it controls or controlled.
label: contrôle ou a contrôlé @fr
label: es o era controlador de @es
change note: Fixed the French label.
  date: 2024-09-02
change note: Aligned with RiC-CM 1.0: updated the description (rdfs:comment).
  date: 2023-11-12
change note: In order to get a system of rolified Relation classes: modified the property chain axiom so that it now involves the new agentControlRelation_role object property.
  date: 2023-11-08
change note: Added a new rdfs:label in Spanish.
  date: 2023-11-02
change note: Added a new rdfs:label in French.
  date: 2023-08-28
change note:
  date: 2021-01-22
  value: changed the IRI, label, inverse property IRI, text definition, corresponding CM component name (changed made in order to make RiC-O compliant with RiC-CM 0.2; the name of this property in RiC-O 0.1 was "controls").
RiC-CM corresponding component: RiC-R041 ('is or was controller of' relation)

is or was coordinates of
type: ObjectProperty
sub property of: is related to
inverse of: has or had coordinates
domain: Coordinates
range: Physical Location
comment: Connects an instance of Coordinates to a Physical Location it locates or located on earth, according to some reference system.
label: ont ou ont été les coordonnées de @fr
label: son o eran coordenadas de lugar de @es
change note: Added a new rdfs:label in Spanish.
  date: 2023-11-02
change note: Added a new rdfs:label in French.
  date: 2023-08-28
change note: changed the IRI, label, inverse property IRI, text definition (the name of this property in RiC-O 0.1 was "isCoordinatesOf").
  date: 2021-01-22

is or was corporate body type of
type: ObjectProperty
sub property of: is or was type of
inverse of: has or had corporate body type
domain: Corporate Body Type
range: Corporate Body
comment: Connects a Corporate Body Type to a Corporate Body that it categorizes or categorized.
label: es o era tipo de institución de @es
label: est ou a été le type de collectivité de @fr
change note: Added a new rdfs:label in Spanish.
  date: 2023-11-02
change note: Added a new rdfs:label in French.
  date: 2023-08-28
change note: changed the IRI, label, inverse property IRI, text definition (the name of this property in RiC-O 0.1 was "isCorporateBodyTypeOf").
  date: 2021-01-22

is or was creation date of all members of
type: ObjectProperty
sub property of: is beginning date of
inverse of: has or had all members with creation date
domain: Date
range: Record Set
comment: Connects a Date to a Record Set all of whose present or past members were or will be created at this Date.
label: es o era fecha de creación de todos los miembros de @es
label: est ou a été la date de création de tous les membres de @fr
change note: Changed definition (added "or will be").
  date: 2025-02-19
change note: Added a new rdfs:label in Spanish.
  date: 2023-11-27
change note: renamed the property in order to take the past members of the record set into account. Adjusted the annotations accordingly.
  date: 2023-10-13
change note: Added the French label
  date: 2023-10-12
change note: Added in RiC-O 1.0.
  date: 2023-09-22
RiC-CM corresponding component: RiC-R081 ('is or was creation date of all members of' relation)

is or was creation date of most members of
type: ObjectProperty
sub property of: is or was creation date of some members of
inverse of: has or had most members with creation date
domain: Date
range: Record Set
comment: Connects a Date to a Record Set most of whose present or past members were or will be created at this Date.
label: es o era fecha de creación de la mayoría de los miembros de @es
label: est ou a été la date de création de la plupart des membres de @fr
change note: Changed definition (added "or will be").
  date: 2025-02-19
change note: Added a new rdfs:label in Spanish.
  date: 2023-11-27
change note: Renamed the property in order to take the past members of the record set into account. Adjusted the annotations accordingly.
  date: 2023-10-13
change note: Added the French label
  date: 2023-10-12
change note: Made this property a subproperty of isCreationDateOfSomeMembersOf.
  date: 2023-10-10
change note: Added in RiC-O 1.0.
  date: 2023-09-22
scope note: To be used for specifying a bulk date, i.e. the predominant date of the members of the record set.
RiC-CM corresponding component: RiC-R083 ('is or was creation date of most members of' relation)

is or was creation date of some members of
type: ObjectProperty
sub property of: is beginning date of
inverse of: has or had some members with creation date
domain: Date
range: Record Set
comment: Connects a Date to a Record Set some of whose present or past members were or will be created at this Date.
label: es o era fecha de creación de algunos miembros de @es
label: est ou a été la date de création de certains membres de @fr
change note: Changed definition (added "or will be").
  date: 2025-02-19
change note: Added a new rdfs:label in Spanish.
  date: 2023-11-27
change note: Renamed the property in order to take the past members of the record set into account. Adjusted the annotations accordingly.
  date: 2023-10-13
change note: Added the French label and the rdfs:comment
  date: 2023-10-12
change note: Added in RiC-O 1.0.
  date: 2023-09-22
RiC-CM corresponding component: RiC-R082 ('is or was creation date of some members of' relation)

is or was demographic group of
type: ObjectProperty
sub property of: is or was type of
inverse of: has or had demographic group
domain: Demographic Group
range: Class
  union of: Group
  union of: Person
comment: Connects a Demographic Group to a Person or Group which belongs or belonged to it.
label: es o era grupo demográfico de @es
label: est ou a été le groupe démographique de @fr
change note: Changed the French label (replaced 'catégorie' with 'groupe').
  date: 2024-10-10
change note: Added a new rdfs:label in Spanish.
  date: 2023-11-02
change note: Added a new rdfs:label in French.
  date: 2023-08-28
change note: changed the IRI, label, inverse property IRI, text definition, range (the name of this property in RiC-O 0.1 was "isDemographicGroupOf").
  date: 2021-01-22

is or was derived from instantiation
type: ObjectProperty
sub property of: follows in time
sub property of: is instantiation associated with instantiation
inverse of: has or had derived instantiation
domain: Instantiation
range: Instantiation
property chain axiom: thing is target of relation
property chain axiom: has the role of the Derivation Relation
property chain axiom: relation has source
comment: Inverse of 'has or had derived instantiation' object property.
label: es o era un derivado de instanciación @es
label: est ou a été une instanciation dérivée de @fr
change note: Added a new rdfs:label in Spanish.
  date: 2023-11-27
change note: In order to get a system of rolified Relation classes: modified the property chain axiom so that it now involves the new derivationRelation_role object property.
  date: 2023-11-08
change note: Added the property chain axiom so that this property is formally defined as a shortcut (the inverse property already was).
  date: 2023-11-07
change note:
  date: 2023-08-29
  value: Updated the IRI, inverse property, definition, labels and RiCMCorrespondingComponent; this in order to make the specification compliant with RiC-CM 1.0. The name of the property in RiC-O 0.2 was 'is derived from instantiation'.
change note: Added a new rdfs:label in French.
  date: 2023-08-28
RiC-CM corresponding component: RiC-R014i ('is or was derived from instantiation' relation)

is or was described by
type: ObjectProperty
sub property of: is or was subject of
inverse of: describes or described
domain: Thing
range: Record Resource
comment: Inverse of 'describes or described' object property.
label: es o fue descrito por @es
label: est ou a été décrit par @fr
change note: Added a new rdfs:label in Spanish.
  date: 2023-11-02
change note: Added a new rdfs:label in French.
  date: 2023-08-28
change note: Added a new rdfs:label in French.
  date: 2023-08-28
change note:
  date: 2021-01-22
  value: changed the IRI, label, inverse property IRI, text definition, corresponding CM component name (changed made in order to make RiC-O compliant with RiC-CM 0.2; the name of this property in RiC-O 0.1 was "describedBy").
RiC-CM corresponding component: RiC-R021i ('is or was described by' relation)

is or was digital instantiation of
type: ObjectProperty
sub property of: is or was instantiation of
inverse of: has or had digital instantiation
domain: Instantiation
range: Record Resource
comment: Inverse of 'has or had digital instantiation' object property.
label: es o era instanciación digital de @es
label: est ou a été une instanciation numérique de @fr
change note: Added a new rdfs:label in Spanish.
  date: 2023-11-27
change note: Added the property.
  date: 2023-08-29

is or was documentary form type of all members of
type: ObjectProperty
sub property of: is or was type of all members of
inverse of: has or had all members with documentary form type
domain: Documentary Form Type
range: Record Set
comment: Connects a Documentary Form Type and a Record Set whose all past or present Record or Record Part members have that Documentary Form Type.
label: es o era tipo documental de todos los miembros de @es
label: est ou a été le type de document de tous les membres de @fr
change note: Added a new rdfs:label in Spanish.
  date: 2023-11-02
change note: Added a new rdfs:label in French.
  date: 2023-08-28
change note:
  date: 2020-12-28
  value: Object property added for handling the case where a Record Set is described as having all or some members that belong to some category (see RiC-CM 0.2 attributes section, #4.4 on Record Set, Record and Record Part attributes).

is or was documentary form type of some members of
type: ObjectProperty
sub property of: is or was type of some members of
inverse of: has or had some members with documentary form type
domain: Documentary Form Type
range: Record Set
comment: Connects a Documentary Form Type and a Record Set whose some past or present Record or Record Part members have that Documentary Form Type.
label: es o era tipo documental de algunos miembros de @es
label: est ou a été le type de document de certains membres de @fr
change note: Added a new rdfs:label in Spanish.
  date: 2023-11-02
change note: Added a new rdfs:label in French.
  date: 2023-08-28
change note:
  date: 2020-12-28
  value: Object property added for handling the case where a Record Set is described as having all or some members that belong to some category (see RiC-CM 0.2 attributes section, #4.4 on Record Set, Record and Record Part attributes).

is or was employer of
type: ObjectProperty
sub property of: is or was controller of
inverse of: has or had employer
domain: Class
  union of: Corporate Body
  union of: Person
range: Person
comment: Connects a Corporate Body or a Person to a Person who is or was their employee.
label: a ou a été l'employeur de @fr
label: es o era empleador(a) de @es
change note: Added a new rdfs:label in Spanish.
  date: 2023-11-27
change note: Changed the domain and range of the property. Added a rdfs:comment. Removed the 'has or had member' super-property.
  date: 2023-10-26
change note: Adder for RiC-O v1.0.
  date: 2023-10-19

is or was enforced by
type: ObjectProperty
sub property of: is rule associated with
inverse of: is or was responsible for enforcing
domain: Rule
range: Agent
comment: Connects a Rule to an Agent that enforces or enforced the Rule.
label: es o era una regla aplicada por @es
label: est ou a été imposé par @fr
change note: Fixed the French label.
  date: 2024-09-02
change note: Added a new rdfs:label in Spanish.
  date: 2023-11-02
change note: Added a new rdfs:label in French.
  date: 2023-08-28
change note:
  date: 2021-01-22
  value: changed the IRI, label, inverse property IRI, text definition, corresponding CM component name (changed made in order to make RiC-O compliant with RiC-CM 0.2; the name of this property in RiC-O 0.1 was "enforcedBy").
RiC-CM corresponding component: RiC-R066 ('is or was enforced by' relation)

is or was expressed by
type: ObjectProperty
sub property of: is rule associated with
inverse of: expresses or expressed
domain: Rule
range: Record Resource
comment: Connects a Rule to a Record Resource that expresses or expressed the Rule.
label: es o era una regla expresada en @es
label: est ou a été exprimé par @fr
change note: Added a new rdfs:label in Spanish.
  date: 2023-11-02
change note: Added a new rdfs:label in French.
  date: 2023-08-28
change note:
  date: 2021-01-22
  value: changed the IRI, label, inverse property IRI, text definition, corresponding CM component name (changed made in order to make RiC-O compliant with RiC-CM 0.2; the name of this property in RiC-O 0.1 was "expressedBy").
RiC-CM corresponding component: RiC-R064 ('is or was expressed by' relation)

is or was holder of
type: ObjectProperty
sub property of: is or was manager of
inverse of: has or had holder
domain: Agent
range: Class
  union of: Instantiation
  union of: Record Resource
property chain axiom: thing is source of relation
property chain axiom: has the role of the Record Resource Holding Relation
property chain axiom: relation has target
comment: Connects an Agent to a Record Resource or Instantiation that the Agent holds or held.
label: détient ou a détenu @fr
label: es o era conservador de @es
change note: In order to get a system of rolified Relation classes: modified the property chain axiom so that it now involves the new recordResourceHoldingRelation_role object property.
  date: 2023-11-08
change note: Added a new rdfs:label in Spanish.
  date: 2023-11-02
change note: Added a new rdfs:label in French.
  date: 2023-08-28
change note:
  date: 2021-01-22
  value: changed the IRI, label, inverse property IRI, super = property IRI and text definition (changed made in order to make RiC-O compliant with RiC-CM 0.2; the name of this property in RiC-O 0.1 was "isHolderOf").
RiC-CM corresponding component: RiC-R039 ('is or was holder of' relation)

is or was holder of intellectual property rights of
type: ObjectProperty
sub property of: has or had authority over
inverse of: has or had intellectual property rights holder
domain: Class
  union of: Group
  union of: Person
  union of: Position
range: Class
  union of: Instantiation
  union of: Record Resource
property chain axiom: thing is source of relation
property chain axiom: has the role of the Intellectual Property Rights Relation
property chain axiom: relation has target
comment: Connects an Agent to a Record Resource or Instantiation on which the Agent has or had some intellectual property rights.
label: détient ou a détenu les droits de propriété intellectuelle sur @fr
label: es o era conservador de derechos de propiedad intelectual de @es
change note: In order to get a system of rolified Relation classes: modified the property chain axiom so that it now involves the new intellectualPropertyRightsRelation_role object property.
  date: 2023-11-08
change note: Added a new rdfs:label in Spanish.
  date: 2023-11-02
change note: Added a new rdfs:label in French.
  date: 2023-08-28
change note:
  date: 2021-01-22
  value: changed the IRI, label, inverse property IRI and textual definition (changed made in order to make RiC-O compliant with RiC-CM 0.2; the name of this property in RiC-O 0.1 was "hasIntellectualPropertyRightsOn").
RiC-CM corresponding component: RiC-R040 ('is or was holder of intellectual property rights of' relation)

is or was identifier of
type: ObjectProperty
sub property of: is or was appellation of
inverse of: has or had identifier
domain: Identifier
range: Thing
comment: Connects an Identifier to a Thing that it identified or identifies.
label: es o era identificador de @es
label: est ou a été l’identifiant de @fr
change note: Added a new rdfs:label in Spanish.
  date: 2023-11-02
change note: Added a new rdfs:label in French.
  date: 2023-08-28
change note: changed the IRI, label, inverse property IRI, text definition, super property IRI (the name of this property in RiC-O 0.1 was "identifies").
  date: 2021-01-22

is or was included in
type: ObjectProperty
sub property of: is or was part of
sub property of: is record resource associated with record resource
inverse of: includes or included
domain: Class
  union of: Documento
  union of: Record Set
range: Record Set
comment: Inverse of 'includes or included' object property.
label: está o estaba incluido en @es
label: est ou a été inclus dans @fr
change note: Added a new rdfs:label in Spanish.
  date: 2023-11-02
change note: Added a new rdfs:label in French.
  date: 2023-08-28
change note: Made this object property a subproperty of isOrWasPartOf.
  date: 2023-06-05
change note: changed the IRI, label, inverse property IRI, text definition (changed made in order to make RiC-O compliant with RiC-CM 0.2; the name of this property in RiC-O 0.1 was "includedIn").
  date: 2021-01-22
RiC-CM corresponding component: RiC-R024i ('is or was included in' relation)

is or was instantiation of
type: ObjectProperty
sub property of: is related to
inverse of: has or had instantiation
domain: Instantiation
range: Record Resource
property chain axiom: thing is target of relation
property chain axiom: has the role of the Record Resource to Instantiation Relation
property chain axiom: relation has source
comment: Inverse of 'has or had instantiation' object property.
label: es o era instanciación de @es
label: est ou a été une instanciation de @fr
change note: Added a new rdfs:label in Spanish.
  date: 2023-11-27
change note: In order to get a system of rolified Relation classes: modified the property chain axiom so that it now involves the new recordResourceToInstantiationRelation_role object property.
  date: 2023-11-08
change note:
  date: 2023-08-29
  value: Updated the IRI, inverse property, definition, labels and RiCMCorrespondingComponent; this in order to make the specification compliant with RiC-CM 1.0. The name of the property in RiC-O 0.2 was 'is instantiation of'.
change note: Added a new rdfs:label in French.
  date: 2023-08-28
change note: changed the IRI and label (changed made in order to make RiC-O compliant with RiC-CM 0.2; the name of this property in RiC-O 0.1 was "instantiates").
  date: 2021-01-22
RiC-CM corresponding component: RiC-R025i ('is or was instantiation of' relation)

is or was jurisdiction of
type: ObjectProperty
sub property of: is place associated with agent
inverse of: has or had jurisdiction
domain: Place
range: Agent
comment: Connects a Place to an Agent that has or had jurisdiction over the Place.
label: es o era jurisdicción de @es
label: est ou a été le ressort de @fr
change note: Fixed the French label.
  date: 2024-09-02
change note: Added a new rdfs:label in Spanish.
  date: 2023-11-02
change note: Made subproperty of new property isPlaceAssociatedWithAgent instead of its parent isPlaceAssociatedWith.
  date: 2023-10-19
change note: Added a new rdfs:label in French.
  date: 2023-08-28
change note: changed the IRI, label, inverse property IRI, textual definition (changed made in order to make RiC-O compliant with RiC-CM 0.2; the name of this property in RiC-O 0.1 was "isJurisdictionOf").
  date: 2021-01-22
RiC-CM corresponding component: RiC-R076 ('is or was jurisdiction of' relation)

is or was language of
type: ObjectProperty
sub property of: is related to
inverse of: has or had language
domain: Language
range: Class
  union of: Agent
  union of: Documento
  union of: Record Part
comment: Connects a Language to an Agent, Record or Record Part that uses or used it.
label: es o era lengua de @es
label: est ou a été la langue de @fr
change note: Added a new rdfs:label in Spanish.
  date: 2023-11-02
change note: Added a new rdfs:label in French.
  date: 2023-08-28
change note: changed the IRI, label, inverse property IRI, textual definition (the name of this property in RiC-O 0.1 was "isLanguageOf").
  date: 2021-01-22

is or was language of all members of
type: ObjectProperty
sub property of: is related to
inverse of: has or had all members with language
domain: Language
range: Record Set
comment: Connects a Language and a Record Set whose all present or past Record or Record Part members use that Language.
label: es o era lengua de todos los miembros de @es
label: est ou a été la langue de tous les membres de @fr
change note: Added a new rdfs:label in Spanish.
  date: 2023-11-02
change note: Added a new rdfs:label in French.
  date: 2023-08-28
change note:
  date: 2020-12-28
  value: Object property added for handling the case where a Record Set is described as having all or some members that belong to some category (see RiC-CM 0.2 attributes section, #4.4 on Record Set, Record and Record Part attributes).

is or was language of some members of
type: ObjectProperty
sub property of: is related to
inverse of: has or had some members with language
domain: Language
range: Record Set
comment: Connects a Language and a Record Set whose some present or past Record or Record Part members use that Language.
label: es o era lengua de algunos miembros de @es
label: est ou a été la langue de certains membres de @fr
change note: Added a new rdfs:label in Spanish.
  date: 2023-11-02
change note: Added a new rdfs:label in French.
  date: 2023-08-28
change note:
  date: 2020-12-28
  value: Object property added for handling the case where a Record Set is described as having all or some members that belong to some category (see RiC-CM 0.2 attributes section, #4.4 on Record Set, Record and Record Part attributes).

is or was leader of
type: ObjectProperty
sub property of: is or was controller of
inverse of: has or had leader
domain: Person
range: Group
property chain axiom: thing is source of relation
property chain axiom: has the role of the Leadership Relation
property chain axiom: relation has target
comment: Connects a Person to the Group that Person leads or led in the past.
label: es o era líder de @es
label: est ou a été le dirigeant de @fr
change note: In order to get a system of rolified Relation classes: modified the property chain axiom so that it now involves the new leadershipRelation_role object property.
  date: 2023-11-08
change note: Added a new rdfs:label in Spanish.
  date: 2023-11-02
change note: Added a new rdfs:label in French.
  date: 2023-08-28
change note:
  date: 2021-01-22
  value: changed the IRI, label, inverse property IRI, super property IRI, textual definition (changed made in order to make RiC-O compliant with RiC-CM 0.2; the name of this property in RiC-O 0.1 was "isLeaderOf").
RiC-CM corresponding component: RiC-R042 ('is or was leader of' relation)

is or was legal status of
type: ObjectProperty
sub property of: is or was type of
inverse of: has or had legal status
domain: Legal Status
range: Class
  union of: Agent
  union of: Documento
  union of: Record Part
comment: Connects a Legal Status to an Agent or Record Resource that it categorizes.
label: es o era status jurídico de @es
label: est ou a été le statut légal de @fr
change note: Added a new rdfs:label in Spanish.
  date: 2023-11-02
change note: Added a new rdfs:label in French.
  date: 2023-08-28
change note: changed the IRI, label, inverse property IRI, textual definition (the name of this property in RiC-O 0.1 was "isLegalStatusOf").
  date: 2021-01-22
scope note: Connects a Legal Status to an Agent, Record or Record Part that it categorized or categorizes.

is or was legal status of all members of
type: ObjectProperty
sub property of: is or was type of all members of
inverse of: has or had all members with legal status
domain: Legal Status
range: Record Set
comment: Connects a Legal Status and a Record Set whose all past or present Record or Record Part members have that Legal Status.
label: es o era status jurídico de todos los miembros de @es
label: est ou a été le statut légal de tous les membres de @fr
change note: Added a new rdfs:label in Spanish.
  date: 2023-11-02
change note: Added a new rdfs:label in French.
  date: 2023-08-28
change note:
  date: 2020-12-28
  value: Object property added for handling the case where a Record Set is described as having all or some members that belong to some category (see RiC-CM 0.2 attributes section, #4.4 on Record Set, Record and Record Part attributes).

is or was legal status of some members of
type: ObjectProperty
sub property of: is or was type of some members of
inverse of: has or had some members with legal status
domain: Legal Status
range: Record Set
comment: Connects a Legal Status and a Record Set whose some past or present Record or Record Part members have that Legal Status.
label: es o era status jurídico de algunos miembros de @es
label: est ou a été le statut légal de certains membres de @fr
change note: Added a new rdfs:label in Spanish.
  date: 2023-11-02
change note: Added a new rdfs:label in French.
  date: 2023-08-28
change note:
  date: 2020-12-28
  value: Object property added for handling the case where a Record Set is described as having all or some members that belong to some category (see RiC-CM 0.2 attributes section, #4.4 on Record Set, Record and Record Part attributes).

is or was location of
type: ObjectProperty
sub property of: is place associated with
inverse of: has or had location
domain: Place
range: Thing
comment: Connects a Place to a Thing that is or was located in the Place.
label: es o era localización de @es
label: est ou a été la localisation de @fr
change note: Added a new rdfs:label in Spanish.
  date: 2023-11-02
change note: Added a new rdfs:label in French.
  date: 2023-08-28
change note: changed the IRI, label, inverse property IRI, textual definition (changed made in order to make RiC-O compliant with RiC-CM 0.2; the name of this property in RiC-O 0.1 was "isLocationOf").
  date: 2021-01-22
RiC-CM corresponding component: RiC-R075 ('is or was location of' relation)

is or was location of agent
type: ObjectProperty
sub property of: is or was location of
sub property of: is place associated with agent
inverse of: agent has or had location
domain: Place
range: Agent
comment: Connects a Place to an Agent that is or was located in this Place.
label: es o era localización de agente @es
label: est ou a été la localisation de l'agent @fr
change note: Added a new rdfs:label in Spanish.
  date: 2023-11-27
change note: Renamed the property and added an rdfs:comment.
  date: 2023-10-26
change note: Added for RiC-O 1.0.
  date: 2023-10-20

is or was main subject of
type: ObjectProperty
sub property of: is or was subject of
inverse of: has or had main subject
domain: Thing
range: Record Resource
comment: Inverse of 'has or had main subject' object property.
label: es o era la materia principal de @es
label: est ou a été le sujet principal de @fr
change note: Added a new rdfs:label in Spanish.
  date: 2023-11-02
change note: Added a new rdfs:label in French.
  date: 2023-08-28
change note:
  date: 2021-01-22
  value: changed the IRI, label, inverse property IRI, super property IRI, textual definition (changed made in order to make RiC-O compliant with RiC-CM 0.2; the name of this property in RiC-O 0.1 was "isMainSubjectOf").
RiC-CM corresponding component: RiC-R020i ('is or was main subject of' relation)

is or was main subject of all members of
type: ObjectProperty
sub property of: is or was main subject of
sub property of: is or was subject of all members of
inverse of: has or had all members with main subject
domain: Thing
range: Record Set
comment: Inverse of 'has or had all members with main subject' object property.
label: es o era la materia principal de todos los miembros de @es
label: est ou a été le sujet principal de tous les membres de @fr
change note: Introduced in RiC-O 1.1.
  date: 2025-04-05

is or was main subject of some members of
type: ObjectProperty
sub property of: is or was subject of some members of
inverse of: has or had some members with main subject
domain: Thing
range: Record Set
comment: Inverse of 'has or had some members with main subject' object property.
label: es o era la materia principal de algunos miembros de @es
label: est ou a été le sujet principal de certains membres de @fr
change note: Introduced in RiC-O 1.1.
  date: 2025-04-05

is or was main thing represented by content of some members of
type: ObjectProperty
sub property of: is or was main subject of some members of
sub property of: is or was represented by content of some members of
inverse of: has or had some members whose content mainly represents
domain: Thing
range: Record Set
comment: Inverse of 'has or had some members whose content mainly represents' object property.
label: es o era lo principal representado por el contenido de algunos miembros de @es
label: est ou a été la chose principale représentée par le contenu de certains membres de @fr
change note: Introduced in RiC-O 1.1.
  date: 2025-04-06

is or was manager of
type: ObjectProperty
sub property of: has or had authority over
inverse of: has or had manager
domain: Agent
range: Class
  union of: Instantiation
  union of: Record Resource
property chain axiom: thing is source of relation
property chain axiom: has the role of the Management Relation
property chain axiom: relation has target
comment: Connects an Agent to a Record Resource or Instantiation that the Agent managed or manages.
label: es o era gestor de @es
label: est ou a été le gestionnaire de @fr
change note: In order to get a system of rolified Relation classes: modified the property chain axiom so that it now involves the new managementRelation_role object property.
  date: 2023-11-08
change note: Added a new rdfs:label in Spanish.
  date: 2023-11-02
change note: Added a new rdfs:label in French.
  date: 2023-08-28
change note:
  date: 2021-01-22
  value: changed the IRI, label, inverse property IRI, super property IRI, textual definition (changed made in order to make RiC-O compliant with RiC-CM 0.2; the name of this property in RiC-O 0.1 was "isManagerOf").
RiC-CM corresponding component: RiC-R038 ('is or was manager of' relation)

is or was mandate type of
type: ObjectProperty
sub property of: is or was rule type of
inverse of: has or had mandate type
domain: Mandate Type
range: Mandate
comment: Connects a Mandate Type to a Mandate that it categorized or categorizes.
label: es o era tipo de norma de @es
label: est ou a été le type de mandat de @fr
change note: Make capitalisation of rdfs:comment consistent.
  date: 2024-03-15
change note: Added the property, and its inverse one, following the creation of the MandateType class, that corresponds to the new Mandate Type attribute in RiC-CM 1.0.
  date: 2023-11-13

is or was member of
type: ObjectProperty
sub property of: is agent associated with agent
inverse of: has or had member
domain: Person
range: Group
property chain axiom: thing is target of relation
property chain axiom: has the role of the Membership Relation
property chain axiom: relation has source
comment: Inverse of 'has or had member' object property.
label: es o era miembro de @es
label: est ou a été membre de @fr
change note: In order to get a system of rolified Relation classes: modified the property chain axiom so that it now involves the new membershipRelation_role object property.
  date: 2023-11-08
change note: Added a new rdfs:label in Spanish.
  date: 2023-11-02
change note: Added a new rdfs:label in French.
  date: 2023-08-28
change note: changed the IRI, label, inverse property IRI, textual definition (changed made in order to make RiC-O compliant with RiC-CM 0.2; the name of this property in RiC-O 0.1 was "isMemberOf").
  date: 2021-01-22
RiC-CM corresponding component: RiC-R055i ('is or was member of' relation)

is or was name of
type: ObjectProperty
sub property of: is or was appellation of
inverse of: has or had name
domain: Name
range: Thing
comment: Connects a Name to a Thing that it designated or designates.
label: es o era nombre de @es
label: est ou a été le nom de @fr
change note: Added a new rdfs:label in Spanish.
  date: 2023-11-02
change note: Added a new rdfs:label in French.
  date: 2023-08-28
change note: changed the IRI, label, inverse property IRI, textual definition, super property IRI (the name of this property in RiC-O 0.1 was "isNameOf").
  date: 2021-01-22

is or was occupation type of
type: ObjectProperty
sub property of: is or was demographic group of
inverse of: has or had occupation of type
domain: Occupation Type
range: Person
comment: Connects an Occupation Type to a Person whose occupation is or was categorized by it.
label: es o era tipo de ocupación de @es
label: est ou a été le type d’occupation de @fr
change note: Added a new rdfs:label in Spanish.
  date: 2023-11-02
change note: Added a new rdfs:label in French.
  date: 2023-08-28
change note: changed the IRI, label, inverse property IRI, textual definition, super property IRI (the name of this property in RiC-O 0.1 was "isOccupationTypeOf").
  date: 2021-01-22

is or was occupied by
type: ObjectProperty
sub property of: is agent associated with agent
inverse of: occupies or occupied
domain: Position
range: Person
property chain axiom: thing is target of relation
property chain axiom: has the role of the Position Holding Relation
property chain axiom: relation has source
comment: Inverse of 'occupies or occupied' object property.
label: está o estaba ocupado por @es
label: est ou a été occupé par @fr
change note: In order to get a system of rolified Relation classes: modified the property chain axiom so that it now involves the new positionHoldingRelation_role object property.
  date: 2023-11-08
change note: Added a new rdfs:label in Spanish.
  date: 2023-11-02
change note: Added a new rdfs:label in French.
  date: 2023-08-28
change note: changed the IRI, label, inverse property IRI, text definition (changed made in order to make RiC-O compliant with RiC-CM 0.2; the name of this property in RiC-O 0.1 was "occupiedBy").
  date: 2021-01-22
RiC-CM corresponding component: RiC-R054i ('is or was occupied by' relation)

is or was owner of
type: ObjectProperty
sub property of: has or had authority over
inverse of: has or had owner
domain: Class
  union of: Group
  union of: Person
  union of: Position
range: Thing
property chain axiom: thing is source of relation
property chain axiom: has the role of the Ownership Relation
property chain axiom: relation has target
comment: Connects a Group, Person or Position to a Thing that this Agent owns or owned.
label: es o era poseedor(a) de @es
label: est ou a été propriétaire de @fr
change note: In order to get a system of rolified Relation classes: modified the property chain axiom so that it now involves the new ownershipRelation_role object property.
  date: 2023-11-08
change note: Added a new rdfs:label in Spanish.
  date: 2023-11-02
change note: Added a new rdfs:label in French.
  date: 2023-08-28
change note:
  date: 2021-01-22
  value: changed the IRI, label, inverse property IRI, textual definition, super property IRI (changed made in order to make RiC-O compliant with RiC-CM 0.2; the name of this property in RiC-O 0.1 was "isOwnerOf").
RiC-CM corresponding component: RiC-R037 ('is or was owner of' relation)

is or was part of
type: ObjectProperty
sub property of: is related to
inverse of: has or had part
domain: Thing
range: Thing
property chain axiom: thing is target of relation
property chain axiom: has the role of the Whole Part Relation
property chain axiom: relation has source
comment: Inverse of 'has or had part' relation.
label: es o era parte de @es
label: est ou a été une partie de @fr
change note: In order to get a system of rolified Relation classes: modified the property chain axiom so that it now involves the new wholePartRelation_role object property.
  date: 2023-11-08
change note: Added a new rdfs:label in Spanish.
  date: 2023-11-02
change note: Added a new rdfs:label in French.
  date: 2023-08-28
change note: changed the IRI, label, inverse property IRI, textual definition (changed made in order to make RiC-O compliant with RiC-CM 0.2; the name of this property in RiC-O 0.1 was "isPartOf").
  date: 2021-01-22
RiC-CM corresponding component: RiC-R002i ('is or was part of' relation)

is or was participant in
type: ObjectProperty
sub property of: is associated with event
inverse of: has or had participant
domain: Thing
range: Event
comment: Inverse of 'has or had participant' object property.
label: es o era participante de @es
label: participe ou a participé à @fr
change note: Added a new rdfs:label in Spanish.
  date: 2023-11-02
change note: Added a new rdfs:label in French.
  date: 2023-08-28
change note: changed the IRI, label, inverse property IRI, textual definition (changed made in order to make RiC-O compliant with RiC-CM 0.2; the name of this property in RiC-O 0.1 was "involvedIn").
  date: 2021-01-22
RiC-CM corresponding component: RiC-R058i ('is or was participant in' relation)

is or was performed by
type: ObjectProperty
sub property of: has or had participant
inverse of: performs or performed
domain: Activity
range: Agent
property chain axiom: thing is source of relation
property chain axiom: has the role of the Performance Relation
property chain axiom: relation has target
comment: Connects an Activity to an Agent that performed or performs the Activity.
label: es o fue desarrollado por @es
label: est ou a été réalisée par @fr
change note: In order to get a system of rolified Relation classes: modified the property chain axiom so that it now involves the new performanceRelation_role object property.
  date: 2023-11-08
change note: Added a new rdfs:label in Spanish.
  date: 2023-11-02
change note: Added a new rdfs:label in French.
  date: 2023-08-28
change note:
  date: 2021-01-22
  value: changed the IRI, label, inverse property IRI, text definition, super property IRI (changed made in order to make RiC-O compliant with RiC-CM 0.2; the name of this property in RiC-O 0.1 was "performedBy").
RiC-CM corresponding component: RiC-R060 ('is or was performed by' relation)

is or was physical location of
type: ObjectProperty
sub property of: is associated with place
inverse of: has or had physical location
domain: Physical Location
range: Place
comment: Connects a Physical Location to a Place, when it is or was its location.
label: a ou a été la localisation physique de @fr
label: es o era localización física de @es
change note: Added a new rdfs:label in Spanish.
  date: 2023-11-02
change note: Added a new rdfs:label in French.
  date: 2023-08-28
change note: Property made a subproperty of 'isAssociatedWithPlace".
  date: 2021-02-01
change note: changed the IRI, label, inverse property IRI, textual definition (the name of this property in RiC-O 0.1 was "isPhysicalLocationOf").
  date: 2021-01-22

is or was place name of
type: ObjectProperty
sub property of: is or was name of
inverse of: has or had place name
domain: Place Name
range: Place
comment: Connects a Place Name to a Place that was or is designated by it.
label: a ou a été le nom de lieu de @fr
label: es o era nombre de lugar de @es
change note: Added a new rdfs:label in Spanish.
  date: 2023-11-02
change note: Added a new rdfs:label in French.
  date: 2023-08-28
change note: changed the IRI, label, inverse property IRI, text definition, super property IRI (the name of this property in RiC-O 0.1 was "isPlaceNameOf").
  date: 2021-01-22

is or was place type of
type: ObjectProperty
sub property of: is or was type of
inverse of: has or had place type
domain: Place Type
range: Place
comment: Connects a Place Type to a Place that is or was categorized by it.
label: a ou a été le type de lieu de @fr
label: es o era tipo de lugar de @es
change note: Added a new rdfs:label in Spanish.
  date: 2023-11-02
change note: Added a new rdfs:label in French.
  date: 2023-08-28
change note: changed the IRI, label, inverse property IRI, text definition, super property IRI (the name of this property in RiC-O 0.1 was "isPlaceTypeOf").
  date: 2021-01-22

is or was record state of all members of
type: ObjectProperty
sub property of: is or was type of all members of
inverse of: has or had all members with record state
domain: Record State
range: Record Set
comment: Connects a Record State and a Record Set whose all past or present Record or Record Part members have that Record State.
label: a ou a été l’état de tous les membres de @fr
label: es o era estado de documento de todos los miembros de @es
change note: Added a new rdfs:label in Spanish.
  date: 2023-11-02
change note: Added a new rdfs:label in French.
  date: 2023-08-28
change note:
  date: 2020-12-28
  value: Object property added for handling the case where a Record Set is described as having all or some members that belong to some category (see RiC-CM 0.2 attributes section, #4.4 on Record Set, Record and Record Part attributes).

is or was record state of some members of
type: ObjectProperty
sub property of: is or was type of some members of
inverse of: has or had some members with record state
domain: Record State
range: Record Set
comment: Connects a Record State and a Record Set whose some past or present Record or Record Part members have that Record State.
label: a ou a été l’état de certains membres de @fr
label: es o era estado de documento de algunos miembros de @es
change note: Added a new rdfs:label in Spanish.
  date: 2023-11-02
change note: Added a new rdfs:label in French.
  date: 2023-08-28
change note:
  date: 2020-12-28
  value: Object property added for handling the case where a Record Set is described as having all or some members that belong to some category (see RiC-CM 0.2 attributes section, #4.4 on Record Set, Record and Record Part attributes).

is or was regulated by
type: ObjectProperty
sub property of: is associated with rule
inverse of: regulates or regulated
domain: Thing
range: Rule
comment: Inverse of 'regulates or regulated' object property.
label: está o estaba regulado por @es
label: est ou a été régulé par @fr
change note: Added a new rdfs:label in Spanish.
  date: 2023-11-02
change note: Added a new rdfs:label in French.
  date: 2023-08-28
change note: changed the IRI, label, inverse property IRI (changed made in order to make RiC-O compliant with RiC-CM 0.2; the name of this property in RiC-O 0.1 was "regulatedBy").
  date: 2021-01-22
RiC-CM corresponding component: RiC-R063i ('is or was regulated by' relation)

is or was represented by content of some members of
type: ObjectProperty
sub property of: is or was subject of some members of
inverse of: has or had some members whose content represents
domain: Thing
range: Record Set
comment: Inverse of 'has or had some members whose content represents' object property.
label: es o era representado por el contenido de algunos miembros de @es
label: est ou a été représenté par le contenu de certains membres de @fr
change note: Introduced in RiC-O 1.1.
  date: 2025-04-05

is or was responsible for enforcing
type: ObjectProperty
sub property of: is associated with rule
inverse of: is or was enforced by
domain: Agent
range: Rule
comment: Inverse of 'is or was enforced by' object property.
label: es o era responsable de aplicar @es
label: impose ou a imposé @fr
change note: Fixed the French label.
  date: 2024-09-02
change note: Added a new rdfs:label in Spanish.
  date: 2023-11-02
change note: Added a new rdfs:label in French.
  date: 2023-08-28
change note:
  date: 2021-01-22
  value: changed the IRI, label, inverse property IRI, text definition, corresponding CM component name (changed made in order to make RiC-O compliant with RiC-CM 0.2; the name of this property in RiC-O 0.1 was "isResponsibleForEnforcing").
RiC-CM corresponding component: RiC-R066i ('is or was responsible for enforcing' relation)

is or was rule type of
type: ObjectProperty
sub property of: is or was type of
inverse of: has or had rule type
domain: Rule Type
range: Rule
comment: Connects a Rule Type to a Rule that it categorized or categorizes.
label: es o era tipo de regla de @es
label: est ou a été le type de règle de @fr
change note: Make capitalisation of rdfs:comment consistent.
  date: 2024-03-15
change note: Added a new rdfs:label in Spanish.
  date: 2023-11-02
change note: Added a new rdfs:label in French.
  date: 2023-08-28
change note: changed the IRI, label, inverse property IRI, text definition, super property URI (the name of this property in RiC-O 0.1 was "isRuleTypeOf").
  date: 2021-01-22
change note: Object property added along with RuleType class and hasRuleType object property.
  date: 2020-10-19

is or was subdivision of
type: ObjectProperty
sub property of: is or was part of
sub property of: is or was subordinate to
inverse of: has or had subdivision
domain: Group
range: Group
property chain axiom: thing is target of relation
property chain axiom: has the role of the Group Subdivision Relation
property chain axiom: relation has source
comment: Inverse of 'has or had subdivision' object property.
label: es o era subdivisión de @es
label: est ou a été une subdivision de @fr
change note: In order to get a system of rolified Relation classes: modified the property chain axiom so that it now involves the new groupSubdivisionRelation_role object property.
  date: 2023-11-08
change note: Added a new rdfs:label in Spanish.
  date: 2023-11-02
change note: Added a new rdfs:label in French.
  date: 2023-08-28
change note:
  date: 2021-01-22
  value: changed the IRI, label, inverse property IRI, text definition, super property IRIs (changed made in order to make RiC-O compliant with RiC-CM 0.2; the name of this property in RiC-O 0.1 was "isSubdivisionOf").
RiC-CM corresponding component: RiC-R005i ('is or was subdivision' relation)

is or was subevent of
type: ObjectProperty
sub property of: is associated with event
sub property of: is event associated with
sub property of: is or was part of
inverse of: has or had subevent
domain: Event
range: Event
comment: Inverse of 'has or had subevent' object property.
label: es o era parte de evento de @es
label: est ou a été un événement constituant de @fr
change note: Added a new rdfs:label in Spanish.
  date: 2023-11-02
change note: Added a new rdfs:label in French.
  date: 2023-08-28
change note:
  date: 2021-01-22
  value: changed the IRI, label, inverse property IRI, text definition, super property URI (changed made in order to make RiC-O compliant with RiC-CM 0.2; the name of this property in RiC-O 0.1 was "isSubEventOf").
RiC-CM corresponding component: RiC-R006i ('is or was subevent of' relation)

is or was subject of
type: ObjectProperty
sub property of: is related to
inverse of: has or had subject
domain: Thing
range: Record Resource
comment: Inverse of 'has or had subject' object property.
label: es o era materia de @es
label: est ou a été le sujet de @fr
change note: Added a new rdfs:label in Spanish.
  date: 2023-11-02
change note: Added a new rdfs:label in French.
  date: 2023-08-28
change note: changed the IRI, label, inverse property IRI, text definition (changed made in order to make RiC-O compliant with RiC-CM 0.2; the name of this property in RiC-O 0.1 was "isSubjectOf").
  date: 2021-01-22
RiC-CM corresponding component: RIc-R019i ('is or was subject of' relation)

is or was subject of all members of
type: ObjectProperty
sub property of: is or was subject of
inverse of: has or had all members with subject
domain: Thing
range: Record Set
comment: Inverse of 'has or had all members with subject' object property.
label: es o era la matería de todos los miembros de @es
label: est ou a été le sujet de tous les membres de @fr
change note: Introduced in RiC-O 1.1.
  date: 2025-04-05

is or was subject of some members of
type: ObjectProperty
sub property of: is related to
inverse of: has or had some members with subject
domain: Thing
range: Record Set
comment: Inverse of 'has or had some members with subject' object property.
label: es o era la matería de algunos miembros de @es
label: est ou a été le sujet de certains membres de @fr
change note: Introduced in RiC-O 1.1.
  date: 2025-04-05

is or was subordinate to
type: ObjectProperty
sub property of: is agent associated with agent
inverse of: has or had subordinate
domain: Agent
range: Agent
property chain axiom: thing is target of relation
property chain axiom: has the role of the Agent Hierarchical Relation
property chain axiom: relation has source
comment: Inverse of 'has or had subordinate' object property.
label: está o estaba subordinado(a) a @es
label: est ou a été le subalterne de @fr
change note: In order to get a system of rolified Relation classes: modified the property chain axiom so that it now involves the new agentHierarchicalRelation_role object property.
  date: 2023-11-08
change note: Added a new rdfs:label in Spanish.
  date: 2023-11-02
change note: Added a new rdfs:label in French.
  date: 2023-08-28
change note: changed the IRI, label, inverse property IRI (changed made in order to make RiC-O compliant with RiC-CM 0.2; the name of this property in RiC-O 0.1 was "isHierarchicallyInferiorTo").
  date: 2021-01-22
RiC-CM corresponding component: RiC-R045i ('is or was subordinate to' relation)

is or was title of
type: ObjectProperty
sub property of: is or was name of
inverse of: has or had title
domain: Title
range: Class
  union of: Instantiation
  union of: Record Resource
  union of: Rule
comment: Connects a Title to a Record Resource, Instantiation or Rule that it designated or designates.
label: es o era título de @es
label: est ou a été l’intitulé de @fr
change note: Added a new rdfs:label in Spanish.
  date: 2023-11-02
change note: Added a new rdfs:label in French.
  date: 2023-08-28
change note: changed the IRI, label, inverse property IRI, text definition, super property IRI (the name of this property in RiC-O 0.1 was "isTitleOf").
  date: 2021-01-22

is or was type of
type: ObjectProperty
sub property of: is related to
inverse of: has or had type
domain: Type
range: Thing
property chain axiom: thing is source of relation
property chain axiom: has the role of the Type Relation
property chain axiom: relation has target
comment: Connects a Type to a Thing that it categorizes or categorized.
label: es o era lo tipo de @es
label: est ou a été le type de @fr
change note: Changed the word 'category' into 'type' in all applicable properties names.
  date: 2024-10-04
change note: In order to get a system of rolified Relation classes: modified the property chain axiom so that it now involves the new typeRelation_role object property.
  date: 2023-11-08
change note: Added a new rdfs:label in Spanish.
  date: 2023-11-02
change note: Added a new rdfs:label in French.
  date: 2023-08-28
change note: changed the IRI, label, inverse property IRI, text definition (the name of this property in RiC-O 0.1 was "isCategoryOf").
  date: 2021-01-22

is or was type of all members of
type: ObjectProperty
sub property of: is related to
inverse of: has or had all members with type
domain: Type
range: Record Set
comment: Connects a Type and a Record Set whose all present or past Record or Record Part members belong to that Type.
label: es o era lo tipo de todos los miembros de @es
label: est ou a été le type de tous les membres de @fr
change note: Changed the word 'category' into 'type' in all applicable properties names.
  date: 2024-10-04
change note: Added a new rdfs:label in Spanish.
  date: 2023-11-02
change note: Added a new rdfs:label in French.
  date: 2023-08-28
change note:
  date: 2020-12-28
  value: Object property added for handling the case where a Record Set is described as having all or some members that belong to some category (see RiC-CM 0.2 attributes section, #4.4 on Record Set, Record and Record Part attributes).

is or was type of some members of
type: ObjectProperty
sub property of: is related to
inverse of: has or had some members with type
domain: Type
range: Record Set
comment: Connects a Type and a Record Set whose some present or past Record or Record Part members belong to that Type.
label: es o era lo tipo de algunos miembros de @es
label: est ou a été le type de certains membres de @fr
change note: Changed the word 'category' into 'type' in all applicable properties names.
  date: 2024-10-04
change note: Added a new rdfs:label in Spanish.
  date: 2023-11-02
change note: Added a new rdfs:label in French.
  date: 2023-08-28
change note:
  date: 2020-12-28
  value: Object property added for handling the case where a Record Set is described as having all or some members that belong to some category (see RiC-CM 0.2 attributes section, #4.4 on Record Set, Record and Record Part attributes).

is or was under authority of
type: ObjectProperty
sub property of: is related to
inverse of: has or had authority over
domain: Thing
range: Agent
property chain axiom: thing is target of relation
property chain axiom: has the role of the Authority Relation
property chain axiom: relation has source
comment: Inverse of 'has or had authority over' object property.
label: está o estaba bajo control de @es
label: est ou a été sous l’autorité de @fr
change note: In order to get a system of rolified Relation classes: modified the property chain axiom so that it now involves the new authorityRelation_role object property.
  date: 2023-11-08
change note: Added a new rdfs:label in Spanish.
  date: 2023-11-02
change note: Added a new rdfs:label in French.
  date: 2023-08-28
change note: changed the IRI, label, inverse property IRI, text definition (changed made in order to make RiC-O compliant with RiC-CM 0.2; the name of this property in RiC-O 0.1 was "isUnderAuthorityOf").
  date: 2021-01-22
RiC-CM corresponding component: RiC-R036i ('is or was under authority of' relation)

is organic or functional provenance of
type: ObjectProperty
sub property of: is related to
inverse of: has organic or functional provenance
domain: Class
  union of: Activity
  union of: Agent
range: Class
  union of: Instantiation
  union of: Record Resource
property chain axiom: thing is target of relation
property chain axiom: has the role of the Organic or functional provenance Relation
property chain axiom: relation has source
comment: Inverse of 'has organic or functional provenance' object property.
label: es procedencia orgánica o funcional de @es
label: est la provenance organique ou fonctionnelle de @fr
change note: In order to get a system of rolified Relation classes: modified the property chain axiom so that it now involves the new organicOrFunctionalProvenanceRelation_role object property.
  date: 2023-11-08
change note: Property added as a superproperty of isProvenance and documentedBy, along with its inverse property. Shortcut also added.
  date: 2023-11-07

is organic provenance date of
type: ObjectProperty
sub property of: is date associated with
inverse of: has organic provenance date
domain: Date
range: Class
  union of: Instantiation
  union of: Record Resource
property chain axiom: is date associated with Relation
property chain axiom: has the role of the Organic Provenance Relation
property chain axiom: relation has source
comment: Connects a Date associated with the organic provenance of a Record Resource or Instantiation to that Record Resource or Instantiation.
label: es la fecha de procedencia orgánica de @es
label: est la date de provenance organique de @fr
change note: Added French and Spanish labels.
  date: 2025-03-13
change note: Added in RiC-O 1.1.
  date: 2024-12-19

is organic provenance of
type: ObjectProperty
sub property of: is organic or functional provenance of
inverse of: has organic provenance
domain: Agent
range: Class
  union of: Instantiation
  union of: Record Resource
property chain axiom: thing is target of relation
property chain axiom: has the role of the Organic Provenance Relation
property chain axiom: relation has source
comment: Inverse of 'has organic provenance' object property.
label: es procedencia orgánica de @es
label: est la provenance organique de @fr
change note: Make capitalisation of rdfs:comment consistent.
  date: 2024-03-15
change note: In order to get a system of rolified Relation classes: modified the property chain axiom so that it now involves the new organicProvenanceRelation_role object property.
  date: 2023-11-08
change note: Made this property a subproperty of the new isOrganicOrFunctionalProvenanceOf property. Renamed it to make things clearer. Adjusted its labels.
  date: 2023-11-07
change note: Added a new rdfs:label in Spanish.
  date: 2023-11-02
change note: Added a new rdfs:label in French.
  date: 2023-08-28
RiC-CM corresponding component: RiC-R026i ('is provenance of' relation)

is original of
type: ObjectProperty
sub property of: has genetic link to record resource
sub property of: precedes in time
inverse of: has original
domain: Class
  union of: Documento
  union of: Record Part
range: Class
  union of: Documento
  union of: Record Part
comment: Connects the original version of a Record to a copy or a later version.
label: es original de @es
label: est l’original de @fr
change note: Added a new rdfs:label in Spanish.
  date: 2023-11-02
change note: Added a new rdfs:label in French.
  date: 2023-08-28
scope note: There may be zero to many intermediate Records, ignored or unknown, between the two connected Records
RiC-CM corresponding component: RiC-R010 (is original of relation)

is part of transitive
type: ObjectProperty
sub property of: is or was part of
type: TransitiveProperty
inverse of: has part transitive
domain: Thing
range: Thing
comment: Connects a Thing to a Thing of which it is a a constitutive or component part, directly or indirectly. This is a transitive relation.
label: es parte de transitivo @es
label: est une partie de transitif @fr
change note: Added a new rdfs:label in Spanish.
  date: 2023-11-27
change note: Added a French label.
  date: 2023-11-13
change note: Object property added, along with its inverse property, in order to enable to express current partitive relations between things (the past partitive relation also being added).
  date: 2023-07-12
scope note: To be used, either to infer, then query or browse, relations from existing direct 'isDirectPartOf' relations between things, or to record a current partitive relation when you do not know if there are intermediate nodes between the related things.

is place associated with
type: ObjectProperty
sub property of: is related to
inverse of: is associated with place
domain: Place
range: Thing
property chain axiom: thing is source of relation
property chain axiom: has the role of the Place Relation
property chain axiom: relation has target
comment: Connects a Place to a Thing with whose existence and lifecycle the Place is associated.
label: es lugar asociado con @es
label: est un lieu associé à @fr
change note: Aligned with RiC-CM 1.0: updated the description (rdfs:comment), skos:scopeNote.
  date: 2023-11-12
change note: In order to get a system of rolified Relation classes: modified the property chain axiom so that it now involves the new placeRelation_role object property.
  date: 2023-11-08
change note: Added a new rdfs:label in Spanish.
  date: 2023-11-02
change note: Added a new rdfs:label in French.
  date: 2023-08-28
scope note: Use to connect a Place to an entity only if it is not possible to specify a narrower spatial relation, for example, is or was location of.
RiC-CM corresponding component: RiC-R074 ('is place associated with' relation)

is place associated with agent
type: ObjectProperty
sub property of: is place associated with
inverse of: is agent associated with place
domain: Place
range: Agent
comment: Connects a Place to an Agent which is related to that Place.
label: es lugar asociado con agente @es
label: est un lieu associé à l'agent @fr
change note: Added a new rdfs:label in Spanish.
  date: 2023-11-27
change note: fixed the domain and range, added a rdfs:comment and English and French labels.
  date: 2023-10-26
change note: Added for RiC-O v1.0.
  date: 2023-10-19

is production technique type of
type: ObjectProperty
sub property of: is or was type of
inverse of: has production technique type
domain: Production Technique Type
range: Instantiation
comment: Connects a Production Technique Type to an Instantiation whose production technique is categorized by it.
label: es tipo de técnica de producción de @es
label: est le type de technique de production de @fr
change note: Added a new rdfs:label in Spanish.
  date: 2023-11-02
change note: Added a new rdfs:label in French.
  date: 2023-08-28
change note: changed the super property IRI.
  date: 2021-01-22

is publication date of
type: ObjectProperty
sub property of: is date associated with
inverse of: has publication date
domain: Date
range: Record Resource
comment: Connects a Date to a Record Resource that was or will be made public at this Date.
label: es fecha de publicación de @es
label: est la date de publication de @fr
change note: Made the property a subproperty of isDateAssociatedWith (instead of isBeginningDateOf).
  date: 2025-03-01
change note: Changed definition (added "or will be").
  date: 2025-02-19
change note: Added a new rdfs:label in Spanish.
  date: 2023-11-27
change note: Added the French label
  date: 2023-10-12
change note: Added in RiC-O 1.0.
  date: 2023-09-22

is publisher of
type: ObjectProperty
sub property of: is related to
inverse of: has publisher
domain: Agent
range: Record Resource
comment: Connects an Agent to a Record Resource that it published.
label: es editor(a) de @es
label: est l’éditeur de @fr
change note: Added a new rdfs:label in Spanish.
  date: 2023-11-02
change note: Added a new rdfs:label in French.
  date: 2023-08-28
change note: changed the IRI, label, inverse property IRI (the name of this property in RiC-O 0.1 was "publishes").
  date: 2021-01-22

is receiver of
type: ObjectProperty
sub property of: is accumulator of
inverse of: has receiver
domain: Agent
range: Class
  union of: Instantiation
  union of: Record Resource
comment: Inverse of 'received by' object property.
label: es receptor(a) de @es
label: reçoit @fr
change note: Added a new rdfs:label in Spanish.
  date: 2023-11-02
change note: Added a new rdfs:label in French.
  date: 2023-08-28
change note: changed the IRI, label, inverse property IRI, super property IRI (changed made in order to make RiC-O compliant with RiC-CM 0.2; the name of this property in RiC-O 0.1 was "receives").
  date: 2021-01-22
RiC-CM corresponding component: RiC-R029i ('is receiver of' relation)

is record resource associated with record resource
type: ObjectProperty
sub property of: is related to
type: SymmetricProperty
domain: Record Resource
range: Record Resource
property chain axiom: thing is connected to relation
property chain axiom: has the role of the Record Resource to Record Resource Relation
property chain axiom: relation connects
comment: Connects two Record Resources. This relation is symmetric.
label: es recurso documental asociado con @es
label: est une ressource archivistique associée avec la ressource archivistique @fr
change note: Fixed the French label.
  date: 2023-11-25
change note: Aligned with RiC-CM 1.0: updated the description (rdfs:comment), skos:scopeNote.
  date: 2023-11-12
change note: In order to get a system of rolified Relation classes: modified the property chain axiom so that it now involves the new recordResourceToRecordResourceRelation_role object property.
  date: 2023-11-08
change note: Added a new rdfs:label in Spanish.
  date: 2023-11-02
change note: Added a new rdfs:label in French.
  date: 2023-08-28
scope note: Use to connect two Record Resources only if it is not possible to use a narrower, more specific relation, for example has genetic link to.
RiC-CM corresponding component: RiC-R022 ('is record resource associated with record resource' relation)

is record set type of
type: ObjectProperty
sub property of: is or was type of
inverse of: has record set type
domain: Record Set Type
range: Record Set
comment: Connects a Record Set Type to a Record Set that it categorizes.
label: es tipo de agrupación documental de @es
label: est le type d’ensemble d’objets informationnels de @fr
change note: Added a new rdfs:label in Spanish.
  date: 2023-11-02
change note: Added a new rdfs:label in French.
  date: 2023-08-28
change note: changed the super property IRI.
  date: 2021-01-22

is record state of
type: ObjectProperty
sub property of: is or was type of
inverse of: has record state
domain: Record State
range: Class
  union of: Documento
  union of: Record Part
comment: Connects a Record State to a Record or Record Part whose state it categorizes.
label: es estado de documento de @es
label: est l’état de @fr
change note: Added a new rdfs:label in Spanish.
  date: 2023-11-02
change note: Added a new rdfs:label in French.
  date: 2023-08-28
change note: Changed the IRI, label, textual definition and range (Record Resource removed, replaced by Record or Record Part).
  date: 2020-12-28

is related to
type: ObjectProperty
type: SymmetricProperty
domain: Thing
range: Thing
property chain axiom: thing is connected to relation
property chain axiom: has the role of the Relation
property chain axiom: relation connects
comment: The most generic relation, is related to, connects any Thing to any other Thing. This relation is symmetric.
label: está relacionado con @es
label: est relié à @fr
change note: Aligned with RiC-CM 1.0: updated the description (rdfs:comment).
  date: 2023-11-12
change note: Added the property chain axiom in order to make this property a shortcut.
  date: 2023-11-08
change note: Added a new rdfs:label in Spanish.
  date: 2023-11-02
change note: Added a new rdfs:label in French.
  date: 2023-08-28
RiC-CM corresponding component: RiC-R001 ('is related to' relation)

is reply to
type: ObjectProperty
sub property of: follows in time
sub property of: is record resource associated with record resource
inverse of: has reply
domain: Record Resource
range: Record Resource
comment: Inverse of 'has reply' object property.
label: es contestación de @es
label: est une réponse à @fr
change note: Added a new rdfs:label in Spanish.
  date: 2023-11-02
change note: Added a new rdfs:label in French.
  date: 2023-08-28
change note: changed the IRI, label, inverse property IRI, text definition (changed made in order to make RiC-O compliant with RiC-CM 0.2; the name of this property in RiC-O 0.1 was "repliesTo").
  date: 2021-01-22
RiC-CM corresponding component: RiC-R013i ('is reply to' relation)

is representation type of
type: ObjectProperty
sub property of: is or was type of
inverse of: has representation type
domain: Representation Type
range: Instantiation
comment: Connects a Representation Type to an Instantiation that it categorizes.
label: es tipo de grabación de @es
label: est le type de représentation de @fr
change note: Added a new rdfs:label in Spanish.
  date: 2023-11-02
change note: Added a new rdfs:label in French.
  date: 2023-08-28
change note: changed the super property IRI.
  date: 2021-01-22

is represented by content of
type: ObjectProperty
sub property of: is or was subject of
inverse of: has content which represents
domain: Thing
range: Class
  union of: Documento
  union of: Record Part
comment: Inverse of 'has content which represents' object property.
label: es representado por el contenido de @es
label: est représenté par le contenu de @fr
change note: Introduced in RiC-O 1.1.
  date: 2025-04-04

is responsible for issuing
type: ObjectProperty
sub property of: is associated with rule
inverse of: issued by
domain: Agent
range: Rule
comment: Inverse of 'issued by' object property.
label: es responsable de emisión de @es
label: est chargé de rendre publique @fr
change note: Added a new rdfs:label in Spanish.
  date: 2023-11-02
change note: Added a new rdfs:label in French.
  date: 2023-08-28
RiC-CM corresponding component: RiC-R065i ('is responsible for issuing' relation)

is rule associated with
type: ObjectProperty
sub property of: is related to
inverse of: is associated with rule
domain: Rule
range: Thing
property chain axiom: thing is source of relation
property chain axiom: has the role of the Rule Relation
property chain axiom: relation has target
comment: Connects a Rule to a Thing that is associated with the Rule.
label: es regla asociada con @es
label: est une règle associée à @fr
change note: Aligned with RiC-CM 1.0: updated the description (rdfs:comment), skos:scopeNote.
  date: 2023-11-12
change note: In order to get a system of rolified Relation classes: modified the property chain axiom so that it now involves the new ruleRelation_role object property.
  date: 2023-11-08
change note: Added a new rdfs:label in Spanish.
  date: 2023-11-02
change note: Added a new rdfs:label in French.
  date: 2023-08-28
scope note: Use only if it is not possible to specify a narrower Rule relation, for example, regulates or regulated.
RiC-CM corresponding component: RiC-R062 ('is rule associated with' relation)

is sender of
type: ObjectProperty
sub property of: is organic provenance of
inverse of: has sender
domain: Agent
range: Class
  union of: Instantiation
  union of: Record Resource
comment: Inverse of 'has sender' object property.
label: es remitente de @es
label: est l’expéditeur de @fr
change note: Added a new rdfs:label in Spanish.
  date: 2023-11-02
change note: Added a new rdfs:label in French.
  date: 2023-08-28
RiC-CM corresponding component: RiC-R031i ('is sender of' relation)

is source of information of Record Resource
type: ObjectProperty
sub property of: is record resource associated with record resource
inverse of: Record Resource has source of information
domain: Record Resource
range: Record Resource
comment: Connects a Record Resource to a Record Resource, when the first is used as a source of information for producing the content of the second one.
label: es fuente de información de recurso documental @es
label: est une source d’information de la ressource archivistique @fr
change note:
  date: 2025-01-17
  value: Object property added in RiC-O 1.1, with its inverse one. It replaces, as concerns Record Resources, the former 'isSourceOf' object property, that was available in RiC-0 0.1 and RiC-O 0.2, and was removed in RiC-O 1.0.
scope note: Can be used, for example, for a Record Resource used to produce a Record having documentary form type Authority Record or Finding Aid. Not to be confused with the 'hasGeneticLinkToRecordResource' object property.

is subdivision of transitive
type: ObjectProperty
sub property of: is or was subdivision of
sub property of: is part of transitive
sub property of: is subordinate to transitive
type: TransitiveProperty
inverse of: has subdivision transitive
domain: Group
range: Group
comment: Connects a Group to the Group it is a direct or indirect subdivision of. This is a transitive relation.
label: es subdivisión de transitivo @es
label: est une subdivision de transitif @fr
change note: Added a new rdfs:label in Spanish.
  date: 2023-11-27
change note: Updated the labels.
  date: 2023-11-12
change note: Object property added, along with its inverse property, in order to enable to express current partitive relations between groups (the past partitive relation also being added).
  date: 2023-09-08

is subevent of transitive
type: ObjectProperty
sub property of: is or was subevent of
sub property of: is part of transitive
type: TransitiveProperty
inverse of: has subevent transitive
domain: Event
range: Event
comment: Connects an ongoing Event to an Event of which it is a direct or indirect part. This is a transitive relation.
label: es elemento constitutivo de transitivo @es
label: est un événement constituant de transitif @fr
change note: Added a new rdfs:label in Spanish.
  date: 2023-11-27
change note: Updated the labels.
  date: 2023-11-12
change note: Object property added, along with its inverse property, in order to enable to express partitive relations between ongoing events (the past partitive relation also being added).
  date: 2023-09-08

is subordinate to transitive
type: ObjectProperty
sub property of: is or was subordinate to
type: TransitiveProperty
inverse of: has subordinate transitive
domain: Agent
range: Agent
comment: Connects an Agent to an Agent that is directly or indirectly hierarchically superior. This is a transitive relation.
label: está subordinado(a) a transitivo @es
label: est subalterne de transitif @fr
change note: Added a new rdfs:label in Spanish.
  date: 2023-11-27
change note: Updated the labels.
  date: 2023-11-12
change note: Object property added, along with its inverse property, in order to enable to express current subordination relations between agents (the past subordination relation also being added).
  date: 2023-09-08

is successor of
type: ObjectProperty
sub property of: follows in time
sub property of: is agent associated with agent
inverse of: has successor
domain: Agent
range: Agent
property chain axiom: thing is target of relation
property chain axiom: has the role of the Agent Temporal Relation
property chain axiom: relation has source
comment: Inverse of 'has successor' object property.
label: es sucesor(a) de @es
label: est le successeur de @fr
change note: In order to get a system of rolified Relation classes: modified the property chain axiom so that it now involves the new agentTemporalRelation_role object property.
  date: 2023-11-08
change note: Added a new rdfs:label in Spanish.
  date: 2023-11-02
change note: Added a new rdfs:label in French.
  date: 2023-08-28
change note: changed the inverse property IRI and the text definition.
  date: 2021-01-22
RiC-CM corresponding component: RiC-R016i ('is successor of' relation)

is title type of
type: ObjectProperty
sub property of: is or was type of
inverse of: has title type
domain: Title Type
range: Title
comment: Connects a Title Type and a Title that it categorizes.
label: es tipo de título de @es
label: est le type de titre de @fr
change note: Object property added along with TitleType class and hasTitleType object property.
  date: 2024-10-04

is to use date of
type: ObjectProperty
sub property of: is end date of
inverse of: was used to date
domain: Date
range: Appellation
comment: Connects a Date to an Appellation, when it is the date till which the Appellation was used.
label: es fecha hasta la que se usa @es
label: est la date jusqu’à laquelle est utilisé @fr
change note: Added a new rdfs:label in Spanish.
  date: 2023-11-02
change note: Made this property a subPropertyOf isEndDateOf.
  date: 2023-10-19
change note: Added a new rdfs:label in French.
  date: 2023-08-28

is unit of measurement of
type: ObjectProperty
sub property of: is related to
inverse of: has unit of measurement
domain: Unit Of Measurement
range: Extent
comment: Inverse of 'has unit of measurement' object property.
label: est l’unité de mesure de @fr
label: es unidad de medida de @es
change note: Added a new rdfs:label in Spanish.
  date: 2023-11-02
change note: Added a new rdfs:label in French; added an xml:lang attribute to the rdfs:comment.
  date: 2023-08-28
change note: Object property created along with Extent and UnitOfMeasurement classes, in order to provide methods for handling extent accurately.
  date: 2020-10-28

is within
type: ObjectProperty
sub property of: is associated with date
sub property of: is date associated with
sub property of: is or was part of
inverse of: has within
domain: Date
range: Date
comment: Connects a Date to a Date in which it is contained.
label: está dentro @es
label: est contenu dans @fr
change note: Added a new rdfs:label in Spanish.
  date: 2023-11-27
change note: made this property a subproperty of both isDateAssociatedWith and isAssociatedWithdate, and of isOrWasPartOf.
  date: 2023-10-13
change note: Added the property
  date: 2023-10-12
RiC-CM corresponding component: RiC-R085 ('is within' relation)

issued by
type: ObjectProperty
sub property of: is rule associated with
inverse of: is responsible for issuing
domain: Rule
range: Agent
comment: Connects a Rule to the Agent that issued or published the Rule.
label: emitido por @es
label: rendue publique par @fr
change note: Added a new rdfs:label in Spanish.
  date: 2023-11-02
change note: Added a new rdfs:label in French.
  date: 2023-08-28
RiC-CM corresponding component: RiC-R065 ('issued by' relation)

has the role of the Knowing Of Relation
type: ObjectProperty
sub property of: has the role of the Agent Relation
domain: Knowing Of Relation
range: Knowing Of Relation
comment: Connects a KnowingOfRelation to itself. It is a property that can stand for an instance of the class when necessary, e.g. when you explore a knowledge graph.
label: a le rôle de la Relation de connaissance à propos d’une personne @fr
label: desempeña el papel de la Relación de conocimieto indirecto entre personas @es
change note: Removed global reflexivity (leads to inconsistency).
  date: 2024-08-02
change note:
  date: 2023-11-08
  value: In order to get a system of rolified Relation classes: created the object property, with domain and range the KnowingOfRelation rolified class. Declared it as reflexive. Declared it(s) superproperty(ies).
scope note: This property "rolifies" the KnowingOfRelation class. It should be used only when you have to manage instances of the KnowingOfRelation class, to connect each instance to itself, in order to be able to infer, using OWL-RL and property paths, the two shortcuts corresponding to this n-ary class.

has the role of the Knowing Relation
type: ObjectProperty
sub property of: has the role of the Agent Relation
domain: Knowing Relation
range: Knowing Relation
comment: Connects a KnowingRelation to itself. It is a property that can stand for an instance of the class when necessary, e.g. when you explore a knowledge graph.
label: a le rôle de la Relation de connaissance entre personnes @fr
label: desempeña el papel de la Relación de conocimiento directo entre personas @es
change note: Removed global reflexivity (leads to inconsistency).
  date: 2024-08-02
change note:
  date: 2023-11-08
  value: In order to get a system of rolified Relation classes: created the object property, with domain and range the KnowingRelation rolified class. Declared it as reflexive. Declared it(s) superproperty(ies).
scope note: This property "rolifies" the KnowingRelation class. It should be used only when you have to manage instances of the KnowingRelation class, to connect each instance to itself, in order to be able to infer, using OWL-RL and property paths, the two shortcuts corresponding to this n-ary class.

known by
type: ObjectProperty
sub property of: is agent associated with agent
inverse of: knows of
domain: Person
range: Person
property chain axiom: thing is target of relation
property chain axiom: has the role of the Knowing Of Relation
property chain axiom: relation has source
comment: Inverse of 'knows of' object property.
label: conocido por @es
label: est connue par @fr
change note: In order to get a system of rolified Relation classes: modified the property chain axiom so that it now involves the new knowingOfRelation_role object property.
  date: 2023-11-08
change note: Added a new rdfs:label in Spanish.
  date: 2023-11-02
change note: Added a new rdfs:label in French.
  date: 2023-08-28
RiC-CM corresponding component: RiC-R050i ('known by' relation)

knows
type: ObjectProperty
sub property of: is agent associated with agent
type: SymmetricProperty
domain: Person
range: Person
property chain axiom: thing is connected to relation
property chain axiom: has the role of the Knowing Relation
property chain axiom: relation connects
comment: Connects two Persons that directly know each other during their existence. This relation is symmetric.
label: connaît @fr
label: conoce a @es
change note: Aligned with RiC-CM 1.0: updated the description (rdfs:comment), skos:scopeNote.
  date: 2023-11-12
change note: In order to get a system of rolified Relation classes: modified the property chain axiom so that it now involves the new knowingRelation_role object property.
  date: 2023-11-08
change note: Added a new rdfs:label in Spanish.
  date: 2023-11-02
change note: Added a new rdfs:label in French.
  date: 2023-08-28
scope note: The relation implies that the two Persons met or at least corresponded with each other.
RiC-CM corresponding component: RiC-R051 ('knows' relation)

knows of
type: ObjectProperty
sub property of: is agent associated with agent
inverse of: known by
domain: Person
range: Person
property chain axiom: thing is source of relation
property chain axiom: has the role of the Knowing Of Relation
property chain axiom: relation has target
comment: Connects a Person to another Person they have some knowledge of through time or space.
label: a connaissance de la personne @fr
label: conoce indirectamente a @es
change note: In order to get a system of rolified Relation classes: modified the property chain axiom so that it now involves the new knowingOfRelation_role object property.
  date: 2023-11-08
change note: Added a new rdfs:label in Spanish.
  date: 2023-11-02
change note: Added a new rdfs:label in French.
  date: 2023-08-28
RiC-CM corresponding component: RiC-R050 ('knows of' relation)

has the role of the Leadership Relation
type: ObjectProperty
sub property of: has the role of the Agent Control Relation
domain: Leadership Relation
range: Leadership Relation
comment: Connects a LeadershipRelation to itself. It is a property that can stand for an instance of the class when necessary, e.g. when you explore a knowledge graph.
label: a le rôle de la Relation de direction @fr
label: desempeña el papel de la Relación de liderazgo @es
change note: Removed global reflexivity (leads to inconsistency).
  date: 2024-08-02
change note:
  date: 2023-11-08
  value: In order to get a system of rolified Relation classes: created the object property, with domain and range the LeadershipRelation rolified class. Declared it as reflexive. Declared it(s) superproperty(ies).
scope note: This property "rolifies" the LeadershipRelation class. It should be used only when you have to manage instances of the LeadershipRelation class, to connect each instance to itself, in order to be able to infer, using OWL-RL and property paths, the two shortcuts corresponding to this n-ary class.

leadership with position
type: ObjectProperty
sub property of: relation has context
inverse of: position is context of leadership relation
domain: Leadership Relation
range: Position
comment: Connects a Leadership Relation to the Position occupied by the leading Person.
label: liderazgo en puesto @es
label: relation de direction dans le cadre du poste @fr
change note: Added a new rdfs:label in Spanish.
  date: 2023-11-02
change note: Added a new rdfs:label in French.
  date: 2023-08-28

has the role of the Management Relation
type: ObjectProperty
sub property of: has the role of the Authority Relation
domain: Management Relation
range: Management Relation
comment: Connects a ManagementRelation to itself. It is a property that can stand for an instance of the class when necessary, e.g. when you explore a knowledge graph.
label: a le rôle de la Relation de gestion @fr
label: desempeña el papel de la Relación de gestión @es
change note: Removed global reflexivity (leads to inconsistency).
  date: 2024-08-02
change note:
  date: 2023-11-08
  value: In order to get a system of rolified Relation classes: created the object property, with domain and range the ManagementRelation rolified class. Declared it as reflexive. Declared it(s) superproperty(ies).
scope note: This property "rolifies" the ManagementRelation class. It should be used only when you have to manage instances of the ManagementRelation class, to connect each instance to itself, in order to be able to infer, using OWL-RL and property paths, the two shortcuts corresponding to this n-ary class.

has the role of the Mandate Relation
type: ObjectProperty
sub property of: has the role of the Rule Relation
domain: Mandate Relation
range: Mandate Relation
comment: Connects a MandateRelation to itself. It is a property that can stand for an instance of the class when necessary, e.g. when you explore a knowledge graph.
label: a le rôle de la Relation impliquant un mandat @fr
label: desempeña el papel de la Relación normativa @es
change note: Removed global reflexivity (leads to inconsistency).
  date: 2024-08-02
change note:
  date: 2023-11-08
  value: In order to get a system of rolified Relation classes: created the object property, with domain and range the MandateRelation rolified class. Declared it as reflexive. Declared it(s) superproperty(ies).
scope note: This property "rolifies" the MandateRelation class. It should be used only when you have to manage instances of the MandateRelation class, to connect each instance to itself, in order to be able to infer, using OWL-RL and property paths, the two shortcuts corresponding to this n-ary class.

has the role of the Membership Relation
type: ObjectProperty
sub property of: has the role of the Agent Relation
domain: Membership Relation
range: Membership Relation
comment: Connects a MembershipRelation to itself. It is a property that can stand for an instance of the class when necessary, e.g. when you explore a knowledge graph.
label: a le rôle de la Relation d’appartenance @fr
label: desempeña el papel de la Relación de membresía @es
change note: Removed global reflexivity (leads to inconsistency).
  date: 2024-08-02
change note:
  date: 2023-11-08
  value: In order to get a system of rolified Relation classes: created the object property, with domain and range the MembershipRelation rolified class. Declared it as reflexive. Declared it(s) superproperty(ies).
scope note: This property "rolifies" the MembershipRelation class. It should be used only when you have to manage instances of the MembershipRelation class, to connect each instance to itself, in order to be able to infer, using OWL-RL and property paths, the two shortcuts corresponding to this n-ary class.

membership with position
type: ObjectProperty
sub property of: relation has context
inverse of: position is context of membership relation
domain: Membership Relation
range: Position
comment: Connects a Membership Relation to the Position occupied by the member Person(s).
label: membresía en puesto @es
label: relation d’appartenance dans le cadre du poste @fr
change note: Added a new rdfs:label in Spanish.
  date: 2023-11-02
change note: Added a new rdfs:label in French.
  date: 2023-08-28

migrated from
type: ObjectProperty
sub property of: is or was derived from instantiation
inverse of: migrated into
domain: Instantiation
range: Instantiation
property chain axiom: thing is target of relation
property chain axiom: has the role of the Migration Relation
property chain axiom: relation has source
comment: Inverse of 'migrated into' object property.
label: a été produite par migration de @fr
label: migrado desde @es
change note: In order to get a system of rolified Relation classes: modified the property chain axiom so that it now involves the new migrationRelation_role object property.
  date: 2023-11-08
change note: Added a new rdfs:label in Spanish.
  date: 2023-11-02
change note: Updated subpropertyOf; this in order to make the specification compliant with RiC-CM 1.0.
  date: 2023-08-29
change note: Added a new rdfs:label in French.
  date: 2023-08-28
change note:
  date: 2021-01-22
  value: changed the IRI, label, inverse property IRI, text definition, corresponding CM component name (changed made in order to make RiC-O compliant with RiC-CM 0.2; the name of this property in RiC-O 0.1 was "createdByMigrationFromInstantiation").
RiC-CM corresponding component: RiC-R015i ('migrated from' relation)

migrated into
type: ObjectProperty
sub property of: has or had derived instantiation
inverse of: migrated from
domain: Instantiation
range: Instantiation
property chain axiom: thing is source of relation
property chain axiom: has the role of the Migration Relation
property chain axiom: relation has target
comment: Connects an Instantiation to a version it has been migrated into.
label: a été migrée vers @fr
label: migrado a @es
change note: Aligned with RiC-CM 1.0: updated the description (rdfs:comment).
  date: 2023-11-12
change note: In order to get a system of rolified Relation classes: modified the property chain axiom so that it now involves the new migrationRelation_role object property.
  date: 2023-11-08
change note: Added a new rdfs:label in Spanish.
  date: 2023-11-02
change note: Updated subpropertyOf; this in order to make the specification compliant with RiC-CM 1.0.
  date: 2023-08-29
change note: Added a new rdfs:label in French.
  date: 2023-08-28
change note: changed the IRI, label and inverse property IRI (changed made in order to make RiC-O compliant with RiC-CM 0.2; the name of this property in RiC-O 0.1 was "isMigratedIntoInstantiation").
  date: 2021-01-22
scope note: Use for digital instantiations.
RiC-CM corresponding component: RiC-R015 ('migrated into' relation)

has the role of the Migration Relation
type: ObjectProperty
sub property of: has the role of the Derivation Relation
domain: Migration Relation
range: Migration Relation
comment: Connects a MigrationRelation to itself. It is a property that can stand for an instance of the class when necessary, e.g. when you explore a knowledge graph.
label: a le rôle de la Relation de migration @fr
label: desempeña el papel de la Relación de migración entre instanciaciones @es
change note: Removed global reflexivity (leads to inconsistency).
  date: 2024-08-02
change note:
  date: 2023-11-08
  value: In order to get a system of rolified Relation classes: created the object property, with domain and range the MigrationRelation rolified class. Declared it as reflexive. Declared it(s) superproperty(ies).
scope note: This property "rolifies" the MigrationRelation class. It should be used only when you have to manage instances of the MigrationRelation class, to connect each instance to itself, in order to be able to infer, using OWL-RL and property paths, the two shortcuts corresponding to this n-ary class.

occupies or occupied
type: ObjectProperty
sub property of: is agent associated with agent
inverse of: is or was occupied by
domain: Person
range: Position
property chain axiom: thing is source of relation
property chain axiom: has the role of the Position Holding Relation
property chain axiom: relation has target
comment: Connects a Person to a Position they occupy or occupied.
label: occupe ou a occupé @fr
label: ocupa u ocupaba @es
change note: In order to get a system of rolified Relation classes: modified the property chain axiom so that it now involves the new positionHoldingRelation_role object property.
  date: 2023-11-08
change note: Added a new rdfs:label in Spanish.
  date: 2023-11-02
change note: Added a new rdfs:label in French.
  date: 2023-08-28
change note: changed the IRI, label, inverse property IRI, text definition (changed made in order to make RiC-O compliant with RiC-CM 0.2; the name of this property in RiC-O 0.1 was "occupies").
  date: 2021-01-22
RiC-CM corresponding component: RiC-R054 ('occupies or occupied' relation)

occurred at date
type: ObjectProperty
sub property of: is associated with date
sub property of: is event associated with
inverse of: is date of occurrence of
domain: Event
range: Date
comment: Inverse of 'is date of occurrence of' object property.
label: a pour date d'occurrence @fr
label: tiene como fecha de ocurrencia @es
change note: Added a new rdfs:label in Spanish.
  date: 2023-11-27
change note: Made this property a subproperty of isEventAssociatedWith
  date: 2023-10-17
change note: Renamed the property to correct a spelling mistake. Also corrected the annotations when necessary.
  date: 2023-10-13
RiC-CM corresponding component: RiC-R084i ('occurred at date' relation)

has the role of the Organic or functional provenance Relation
type: ObjectProperty
sub property of: has the role of the Relation
domain: Organic or functional provenance Relation
range: Organic or functional provenance Relation
comment: Connects an OrganicOrFunctionalProvenanceRelation to itself. It is a property that can stand for an instance of the class when necessary, e.g. when you explore a knowledge graph.
label: a le rôle de la Relation de provenance organique ou fonctionnelle @fr
label: desempeña el papel de la Relación de procedencia orgánica or funcional @es
change note: Removed global reflexivity (leads to inconsistency).
  date: 2024-08-02
change note:
  date: 2023-11-08
  value: In order to get a system of rolified Relation classes: created the object property, with domain and range the OrganicOrFunctionalProvenanceRelation rolified class. Declared it as reflexive. Declared it(s) superproperty(ies).
scope note: This property "rolifies" the OrganicOrFunctionalProvenanceRelation class. It should be used only when you have to manage instances of the OrganicOrFunctionalProvenanceRelation class, to connect each instance to itself, in order to be able to infer, using OWL-RL and property paths, the two shortcuts corresponding to this n-ary class.

has the role of the Organic Provenance Relation
type: ObjectProperty
sub property of: has the role of the Organic or functional provenance Relation
domain: Organic Provenance Relation
range: Organic Provenance Relation
comment: Connects an OrganicProvenanceRelation to itself. It is a property that can stand for an instance of the class when necessary, e.g. when you explore a knowledge graph.
label: a le rôle de la Relation de provenance organique @fr
label: desempeña el papel de la Relación de procedencia orgánica @es
change note: Removed global reflexivity (leads to inconsistency).
  date: 2024-08-02
change note:
  date: 2023-11-08
  value: In order to get a system of rolified Relation classes: created the object property, with domain and range the OrganicProvenanceRelation rolified class. Declared it as reflexive. Declared it(s) superproperty(ies).
scope note: This property "rolifies" the OrganicProvenanceRelation class. It should be used only when you have to manage instances of the OrganicProvenanceRelation class, to connect each instance to itself, in order to be able to infer, using OWL-RL and property paths, the two shortcuts corresponding to this n-ary class.

overlaps or overlapped
type: ObjectProperty
sub property of: is associated with place
sub property of: is place associated with
type: SymmetricProperty
domain: Place
range: Place
comment: Connects two Places that geographically overlap or overlapped. This relation is symmetric.
label: chevauche ou a chevauché @fr
label: se superpone o superponía con @es
change note: Aligned with RiC-CM 1.0: updated the description (rdfs:comment).
  date: 2023-11-12
change note: Added a new rdfs:label in Spanish.
  date: 2023-11-02
change note: Added a new rdfs:label in French.
  date: 2023-08-28
change note: changed the IRI, label, text definition (changed made in order to make RiC-O compliant with RiC-CM 0.2; the name of this property in RiC-O 0.1 was "overlaps").
  date: 2021-01-22
RiC-CM corresponding component: RiC-R078 ('overlaps or overlapped' relation)

has the role of the Ownership Relation
type: ObjectProperty
sub property of: has the role of the Authority Relation
domain: Ownership Relation
range: Ownership Relation
comment: Connects an OwnershipRelation to itself. It is a property that can stand for an instance of the class when necessary, e.g. when you explore a knowledge graph.
label: a le rôle de la Relation de propriété @fr
label: desempeña el papel de la Relación de posesión @es
change note: Removed global reflexivity (leads to inconsistency).
  date: 2024-08-02
change note:
  date: 2023-11-08
  value: In order to get a system of rolified Relation classes: created the object property, with domain and range the OwnershipRelation rolified class. Declared it as reflexive. Declared it(s) superproperty(ies).
scope note: This property "rolifies" the OwnershipRelation class. It should be used only when you have to manage instances of the OwnershipRelation class, to connect each instance to itself, in order to be able to infer, using OWL-RL and property paths, the two shortcuts corresponding to this n-ary class.

has the role of the Performance Relation
type: ObjectProperty
sub property of: has the role of the Event Relation
domain: Performance Relation
range: Performance Relation
comment: Connects a PerformanceRelation to itself. It is a property that can stand for an instance of the class when necessary, e.g. when you explore a knowledge graph.
label: a le rôle de la Relation entre activités et agents @fr
label: desempeña el papel de la Relación de desarrollo funcional @es
change note: Removed global reflexivity (leads to inconsistency).
  date: 2024-08-02
change note:
  date: 2023-11-08
  value: In order to get a system of rolified Relation classes: created the object property, with domain and range the PerformanceRelation rolified class. Declared it as reflexive. Declared it(s) superproperty(ies).
scope note: This property "rolifies" the PerformanceRelation class. It should be used only when you have to manage instances of the PerformanceRelation class, to connect each instance to itself, in order to be able to infer, using OWL-RL and property paths, the two shortcuts corresponding to this n-ary class.

performs or performed
type: ObjectProperty
sub property of: is or was participant in
inverse of: is or was performed by
domain: Agent
range: Activity
property chain axiom: thing is target of relation
property chain axiom: has the role of the Performance Relation
property chain axiom: relation has source
comment: Inverse of 'is or was performed by' object property.
label: desarrolla o desarrollaba @es
label: exerce ou a exercé @fr
change note: In order to get a system of rolified Relation classes: modified the property chain axiom so that it now involves the new performanceRelation_role object property.
  date: 2023-11-08
change note: Added a new rdfs:label in Spanish.
  date: 2023-11-02
change note: Added a new rdfs:label in French.
  date: 2023-08-28
change note:
  date: 2021-01-22
  value: changed the IRI, label, inverse property IRI, text definition, super property IRI (changed made in order to make RiC-O compliant with RiC-CM 0.2; the name of this property in RiC-O 0.1 was "performs").
RiC-CM corresponding component: RiC-R060i ('performs or performed' relation)

has the role of the Place Relation
type: ObjectProperty
sub property of: has the role of the Relation
domain: Place Relation
range: Place Relation
comment: Connects a PlaceRelation to itself. It is a property that can stand for an instance of the class when necessary, e.g. when you explore a knowledge graph.
label: a le rôle de la Relation impliquant un lieu @fr
label: desempeña el papel de la Relación con lugar @es
change note: Removed global reflexivity (leads to inconsistency).
  date: 2024-08-02
change note: In order to get a system of rolified Relation classes: created the object property, with domain and range the PlaceRelation rolified class. Declared it as reflexive. Declared it(s) superproperty(ies).
  date: 2023-11-08
scope note: This property "rolifies" the PlaceRelation class. It should be used only when you have to manage instances of the PlaceRelation class, to connect each instance to itself, in order to be able to infer, using OWL-RL and property paths, the two shortcuts corresponding to this n-ary class.

has the role of the Position Holding Relation
type: ObjectProperty
sub property of: has the role of the Agent Relation
domain: Position Holding Relation
range: Position Holding Relation
comment: Connects a PositionHoldingRelation to itself. It is a property that can stand for an instance of the class when necessary, e.g. when you explore a knowledge graph.
label: a le rôle de la Relation entre une personne et un poste @fr
label: desempeña el papel de la Relación de ocupación entre una persona y un puesto @es
change note: Removed global reflexivity (leads to inconsistency).
  date: 2024-08-02
change note:
  date: 2023-11-08
  value: In order to get a system of rolified Relation classes: created the object property, with domain and range the PositionHoldingRelation rolified class. Declared it as reflexive. Declared it(s) superproperty(ies).
scope note: This property "rolifies" the PositionHoldingRelation class. It should be used only when you have to manage instances of the PositionHoldingRelation class, to connect each instance to itself, in order to be able to infer, using OWL-RL and property paths, the two shortcuts corresponding to this n-ary class.

position is context of leadership relation
type: ObjectProperty
sub property of: thing is context of relation
inverse of: leadership with position
domain: Position
range: Leadership Relation
comment: Connects a Position to a Leadership Relation (the leading Person occupies that Position).
label: poste est le contexte de la relation de direction @fr
label: puesto es contexto de relación de liderazgo @es
change note: Updated the labels.
  date: 2023-11-12
change note: Added a new rdfs:label in Spanish.
  date: 2023-11-02

position is context of membership relation
type: ObjectProperty
sub property of: thing is context of relation
inverse of: membership with position
domain: Position
range: Membership Relation
comment: Connects a Position to a Membership Relation (the member Person occupies that Position).
label: poste est le contexte de la relation d'appartenance @fr
label: puesto es contexto de relación de membresía @es
change note: Updated the labels.
  date: 2023-11-12
change note: Added a new rdfs:label in Spanish.
  date: 2023-11-02

has the role of the Position to Group Relation
type: ObjectProperty
sub property of: has the role of the Agent Relation
domain: Position to Group Relation
range: Position to Group Relation
comment: Connects a PositionToGroupRelation to itself. It is a property that can stand for an instance of the class when necessary, e.g. when you explore a knowledge graph.
label: a le rôle de la Relation entre un poste et un groupe @fr
label: desempeña el papel de la Relación de ocupación entre un grupo y un puesto @es
change note: Removed global reflexivity (leads to inconsistency).
  date: 2024-08-02
change note:
  date: 2023-11-08
  value: In order to get a system of rolified Relation classes: created the object property, with domain and range the PositionToGroupRelation rolified class. Declared it as reflexive. Declared it(s) superproperty(ies).
scope note: This property "rolifies" the PositionToGroupRelation class. It should be used only when you have to manage instances of the PositionToGroupRelation class, to connect each instance to itself, in order to be able to infer, using OWL-RL and property paths, the two shortcuts corresponding to this n-ary class.

preceded in sequence
type: ObjectProperty
sub property of: precedes or preceded
inverse of: followed in sequence
domain: Thing
range: Thing
comment: Connects a Thing to a Thing that followed it in some sequence (not necessarily defined or characterised chronologically) in the past.
label: a précédé dans la séquence @fr
label: precedía secuencialmente a @es
change note: Tweaked the rdfs:comment to try to clarify what is meant.
  date: 2025-03-04
change note: Added a new rdfs:label in Spanish.
  date: 2023-11-27
change note: Updated the labels.
  date: 2023-11-12
change note: Renamed the property and modified its definition (rdfs:comment) in order to better distinguish it from precedesInTime.
  date: 2023-09-22
change note:
  date: 2023-09-08
  value: Object property added, along with its inverse property, in order to enable to express past sequential relations between things (the current sequential relations being also added, including a transitive one).

precedes in sequence transitive
type: ObjectProperty
sub property of: precedes or preceded
type: TransitiveProperty
inverse of: follows in sequence transitive
domain: Thing
range: Thing
property chain axiom: precedes proxy in sequence
property chain axiom: proxy for
comment: Connects a Thing to a Thing that follows it directly or indirectly in some sequence (not necessarily defined or characterised chronologically). This is a transitive relation.
label: précède dans la séquence transitif @fr
label: precede secuencialmente a transitivo @es
change note: Tweaked the rdfs:comment to try to clarify what is meant. Also added a property chain axiom relating it to use of rico:Proxy.
  date: 2025-03-04
change note: Added a new rdfs:label in Spanish.
  date: 2023-11-27
change note: Updated the labels.
  date: 2023-11-12
change note: Renamed the property and modified its definition (rdfs:comment) in order to better distinguish it from precedesInTime.
  date: 2023-09-22
change note: Object property added, along with its inverse property, in order to enable to express current, direct or indirect, sequential relations between things (the past sequential relation also being added).
  date: 2023-09-08

precedes in time
type: ObjectProperty
sub property of: precedes or preceded
type: TransitiveProperty
inverse of: follows in time
domain: Thing
range: Thing
property chain axiom: thing is source of relation
property chain axiom: has the role of the Temporal Relation
property chain axiom: relation has target
comment: Connects a Thing to a Thing that follows it in chronological order. This is a transitive relation.
label: précède dans le temps @fr
label: precede en el tiempo a @es
change note: In order to get a system of rolified Relation classes: modified the property chain axiom so that it now involves the new temporalRelation_role object property.
  date: 2023-11-08
change note: Added a new rdfs:label in Spanish.
  date: 2023-11-02
change note: Property made transitive.
  date: 2023-09-21
change note: Added a new rdfs:label in French.
  date: 2023-08-28
change note: changed the superproperty IRI
  date: 2021-01-22
scope note: There may actually be zero to many intermediate Entities, ignored or unknown, in the chronological sequence between the two connected Entities.
RiC-CM corresponding component: RiC-R009 ('precedes in time' relation)

precedes or preceded
type: ObjectProperty
sub property of: is related to
inverse of: follows or followed
domain: Thing
range: Thing
property chain axiom: thing is source of relation
property chain axiom: has the role of the Sequential Relation
property chain axiom: relation has target
comment: Connects a Thing to a Thing that follows or followed it in some sequence.
label: precede o precedía secuencialmente a @es
label: précède ou a précédé @fr
change note: In order to get a system of rolified Relation classes: modified the property chain axiom so that it now involves the new sequentialRelation_role object property.
  date: 2023-11-08
change note: Added a new rdfs:label in Spanish.
  date: 2023-11-02
change note: Added a new rdfs:label in French.
  date: 2023-08-28
change note:
  date: 2021-01-22
  value: changed the IRI, label, inverse property IRI, text definition, corresponding CM component name (changed made in order to make RiC-O compliant with RiC-CM 0.2; the name of this property in RiC-O 0.1 was "precedes").
scope note: The relation does not specify by itself what criteria are used for ordering the sequence. There may actually be zero to many intermediate Entities, ignored or unkown, in the sequence between the two connected Things. Can be used, for example, for specifying that some Record 'precedes' (has next) some Record within a Record Set.
RiC-CM corresponding component: RiC-R008 ('precedes or preceded' relation)

precedes proxy in sequence
type: ObjectProperty
sub property of: precedes in sequence transitive
inverse of: proxy follows in sequence
domain: Record Resource
range: Proxy
property chain axiom: proxy precedes proxy in sequence transitive
comment: Connects a Record Resource to a Proxy of a Record Resource that it precedes directly or indirectly in some sequence (not necessarily defined or characterised chronologically).
label: precede el proxy en la secuencia @es
label: précède le proxy dans la séquence @fr
change note: Added the French and Spanish labels.
  date: 2025-04-02
change note: Introduced in RiC-O 1.1.
  date: 2025-03-04

proxy directly follows in sequence
type: ObjectProperty
sub property of: directly follows in sequence
sub property of: proxy follows in sequence
inverse of: directly precedes proxy in sequence
domain: Proxy
range: Record Resource
comment: Inverse of 'directly precedes proxy in sequence' object property.
label: proxy sigue directamente en la secuencia @es
label: proxy suit directement dans la séquence @fr
change note: Added the French and Spanish labels.
  date: 2025-04-02
change note: Introduced in RiC-O 1.1.
  date: 2025-03-04

proxy directly follows proxy in sequence
type: ObjectProperty
sub property of: directly follows in sequence
sub property of: proxy follows proxy in sequence transitive
inverse of: proxy directly precedes proxy in sequence
domain: Proxy
range: Proxy
comment: Inverse of 'proxy directly precedes proxy in sequence' object property.
label: proxy sigue directamente el proxy en la secuencia @es
label: proxy suit directement le proxy dans la séquence @fr
change note: Added the French and Spanish labels.
  date: 2025-04-02
change note: Introduced in RiC-O 1.1.
  date: 2025-03-04

proxy directly includes
type: ObjectProperty
sub property of: has direct part
sub property of: proxy includes
inverse of: is directly included in proxy
domain: Proxy
range: Class
  union of: Documento
  union of: Record Set
comment: Inverse of 'is directly included in proxy' object property.
label: proxy inclut directement @fr
label: proxy incluye directamente @es
change note: Added the French and Spanish labels.
  date: 2025-04-02
change note: Introduced in RiC-O 1.1.
  date: 2025-03-04

proxy directly includes proxy
type: ObjectProperty
sub property of: has direct part
sub property of: proxy includes proxy transitive
inverse of: proxy is directly included in proxy
domain: Proxy
range: Proxy
comment: Inverse of 'proxy is directly included in' object property.
label: proxy inclut directement le proxy @fr
label: proxy incluye directamente el proxy @es
change note: Added the French and Spanish labels.
  date: 2025-04-02
change note: Introduced in RiC-O 1.1.
  date: 2025-03-04

proxy directly precedes in sequence
type: ObjectProperty
sub property of: directly precedes in sequence
sub property of: proxy precedes in sequence
inverse of: directly follows proxy in sequence
domain: Proxy
range: Record Resource
comment: Connects a Proxy of a Record Resource to a Record Resource which it precedes directly in some sequence (not necessarily defined or characterised chronologically).
label: proxy precede directamente en la secuencia @es
label: proxy précède directement dans la séquence @fr
change note: Added the French and Spanish labels.
  date: 2025-04-02
change note: Introduced in RiC-O 1.1.
  date: 2025-03-04

proxy directly precedes proxy in sequence
type: ObjectProperty
sub property of: directly precedes in sequence
sub property of: proxy precedes proxy in sequence transitive
inverse of: proxy directly follows proxy in sequence
domain: Proxy
range: Proxy
comment: Connects a Proxy of a Record Resource to a Proxy of another Record Resource that it precedes directly in some sequence (not necessarily defined or characterised chronologically).
label: proxy precede directamente el proxy en la secuencia @es
label: proxy précède directement le proxy dans la séquence @fr
change note: Added the French and Spanish labels.
  date: 2025-04-02
change note: Added a second owl:subPropertyOf with target 'proxyPrecedesProxyInSequenceTransitive'.
  date: 2025-04-01
change note: Introduced in RiC-O 1.1.
  date: 2025-03-04

proxy follows in sequence
type: ObjectProperty
sub property of: follows in sequence transitive
inverse of: precedes proxy in sequence
domain: Proxy
range: Record Resource
property chain axiom: proxy follows proxy in sequence transitive
comment: Inverse of 'precedes proxy in sequence' object property.
label: proxy sigue en la secuencia @es
label: proxy suit dans la séquence @fr
change note: Added the French and Spanish labels.
  date: 2025-04-02
change note: Introduced in RiC-O 1.1.
  date: 2025-03-04

proxy follows proxy in sequence transitive
type: ObjectProperty
sub property of: follows in sequence transitive
type: TransitiveProperty
inverse of: proxy precedes proxy in sequence transitive
domain: Proxy
range: Proxy
comment: Inverse of 'proxy recedes proxy in sequence transitive' object property.
label: proxy sigue el proxy en la secuencia transitivo @es
label: proxy suit le proxy dans la séquence transitif @fr
change note: Added the French and Spanish labels.
  date: 2025-04-02
change note: Introduced in RiC-O 1.1.
  date: 2025-03-04

proxy for
type: ObjectProperty
sub property of: is related to
inverse of: has proxy
domain: Proxy
range: Record Resource
comment: Connects a Proxy to the Record Resource it stands for in the context of a specific Record Resource.
label: es proxy para @es
label: proxy pour @fr
change note: Changed the rdfs:comment to allow for a context of a Record Resource of any kind, not only a Record Set.
  date: 2025-03-04
change note: Added a new rdfs:label in Spanish.
  date: 2023-11-02
change note: Added a new rdfs:label in French.
  date: 2023-08-28

proxy has constituent
type: ObjectProperty
sub property of: has part transitive
inverse of: is constituent of proxy
domain: Proxy
range: Class
  union of: Documento
  union of: Record Part
property chain axiom: proxy has constituent proxy transitive
comment: Inverse of 'is constituent of proxy' object property.
label: proxy a pour constituant @fr
label: proxy tiene como elemento constitutivo @es
change note: Added the French and Spanish labels.
  date: 2025-04-02
change note: Introduced in RiC-O 1.1.
  date: 2025-03-04

proxy has constituent proxy transitive
type: ObjectProperty
sub property of: has part transitive
type: TransitiveProperty
inverse of: proxy is constituent of proxy transitive
domain: Proxy
range: Proxy
comment: Inverse of 'proxy is constituent of proxy transitive' object property. This is a transitive relation.
label: proxy a pour constituant le proxy (transitif) @fr
label: proxy tiene como elemento constitutivo el proxy (transitivo) @es
change note: Added the French and Spanish labels.
  date: 2025-04-02
change note: Introduced in RiC-O 1.1.
  date: 2025-03-04

proxy has direct constituent
type: ObjectProperty
sub property of: has direct part
sub property of: proxy has constituent
inverse of: is direct constituent of proxy
domain: Proxy
range: Class
  union of: Documento
  union of: Record Part
comment: Inverse of 'is direct constituent of proxy' object property.
label: proxy a pour constituant direct @fr
label: proxy tiene como directo elemento constitutivo @es
change note: Added the French and Spanish labels.
  date: 2025-04-02
change note: Introduced in RiC-O 1.1.
  date: 2025-03-04

proxy has direct constituent proxy
type: ObjectProperty
sub property of: has direct part
sub property of: proxy has constituent proxy transitive
inverse of: proxy is direct constituent of proxy
domain: Proxy
range: Proxy
comment: Inverse of 'proxy is direct constituent of' object property.
label: proxy a pour constituant direct le proxy @fr
label: proxy tiene como directo elemento constitutivo el proxy @es
change note: Added the French and Spanish labels.
  date: 2025-04-02
change note: Introduced in RiC-O 1.1.
  date: 2025-03-04

proxy in
type: ObjectProperty
sub property of: is related to
domain: Proxy
range: Record Resource
comment: Connects a Proxy to the Record Resource in which it stands for (represents) another Record Resource.
label: es proxy en @es
label: proxy dans @fr
change note: Changed the range and rdfs:comment to allow any Record Resource, not only a Record Set.
  date: 2025-03-04
change note: Added a new rdfs:label in Spanish.
  date: 2023-11-02
change note: Added a new rdfs:label in French.
  date: 2023-08-28

proxy in record
type: ObjectProperty
sub property of: proxy in
domain: Proxy
range: Documento
comment: Connects a Proxy to a Record in which it stands for (represents) a Record Part or another Record.
label: proxy dans l’objet informationnel @fr
label: proxy en el documento @es
change note: Added the French and Spanish labels.
  date: 2025-04-02
change note: Introduced in RiC-O 1.1.
  date: 2025-03-04

proxy in record set
type: ObjectProperty
sub property of: proxy in
domain: Proxy
range: Record Set
comment: Connects a Proxy to a Record Set in which it stands for (represents) a Record or another Record Set.
label: proxy dans l’ensemble d’objets informationnels @fr
label: proxy en la agrupación documental @es
change note: Added the French and Spanish labels.
  date: 2025-04-02
change note: Introduced in RiC-O 1.1.
  date: 2025-03-04

proxy includes
type: ObjectProperty
sub property of: has part transitive
inverse of: is included in proxy
domain: Proxy
range: Class
  union of: Documento
  union of: Record Set
property chain axiom: proxy includes proxy transitive
comment: Inverse of 'is included in proxy' object property.
label: proxy inclut @fr
label: proxy incluye @es
change note: Added the French and Spanish labels.
  date: 2025-04-02
change note: Introduced in RiC-O 1.1.
  date: 2025-03-04

proxy includes proxy transitive
type: ObjectProperty
sub property of: has part transitive
type: TransitiveProperty
inverse of: proxy is included in proxy transitive
domain: Proxy
range: Proxy
comment: Inverse of 'proxy is included in proxy transitive' object property. This is a transitive relation.
label: proxy inclut le proxy (transitif) @fr
label: proxy incluye el proxy (transitivo) @es
change note: Added the French and Spanish labels.
  date: 2025-04-02
change note: Introduced in RiC-O 1.1.
  date: 2025-03-04

proxy is constituent of
type: ObjectProperty
sub property of: is part of transitive
inverse of: has constituent proxy
domain: Proxy
range: Class
  union of: Documento
  union of: Record Part
property chain axiom: proxy is constituent of proxy transitive
comment: Connects a Proxy of a Record or Record Part to a Record or Record Part which it is a constituent of, directly or indirectly.
label: proxy est un constituant de @fr
label: proxy es un elemento constitutivo de @es
change note: Added the French and Spanish labels.
  date: 2025-04-02
change note: Introduced in RiC-O 1.1.
  date: 2025-03-04

proxy is constituent of proxy transitive
type: ObjectProperty
sub property of: is part of transitive
type: TransitiveProperty
inverse of: proxy has constituent proxy transitive
domain: Proxy
range: Proxy
comment: Connects a Proxy of a Record or Record Part to a Proxy of another Record or Record Part which it is a constituent of, directly or indirectly. This is a transitive relation.
label: proxy es elemento constitutivo del proxy (transitivo) @es
label: proxy est un constituant du proxy (transitif) @fr
change note: Added the French and Spanish labels.
  date: 2025-04-02
change note: Introduced in RiC-O 1.1.
  date: 2025-03-04

proxy is direct constituent of
type: ObjectProperty
sub property of: is direct part of
sub property of: proxy is constituent of
inverse of: has direct constituent proxy
domain: Proxy
range: Class
  union of: Documento
  union of: Record Part
comment: Connects a Proxy of a Record or Record Part to another Record or Record Part which the first is a direct constituent of.
label: proxy es elemento constitutivo directo de @es
label: proxy est un constituant direct de @fr
change note: Fixed the owl:inverseOf property (was hasConstituentProxy). Added the French and Spanish labels.
  date: 2025-04-02
change note: Introduced in RiC-O 1.1.
  date: 2025-03-04

proxy is direct constituent of proxy
type: ObjectProperty
sub property of: is direct part of
sub property of: proxy is constituent of proxy transitive
inverse of: proxy has direct constituent proxy
domain: Proxy
range: Proxy
comment: Connects a Proxy of a Record or Record Part to a Proxy of another Record or Record Part of which the first is a direct constituent.
label: proxy es elemento constitutivo directo del proxy @es
label: proxy est un constituant direct du proxy @fr
change note: Added the French and Spanish labels.
  date: 2025-04-02
change note: Introduced in RiC-O 1.1.
  date: 2025-03-04

proxy is directly included in
type: ObjectProperty
sub property of: is direct part of
sub property of: proxy is included in
inverse of: directly includes proxy
domain: Proxy
range: Record Set
comment: Connects a Proxy of a Record or Record Set to another Record Set which the first is directly included in.
label: proxy está directamente incluido en @es
label: proxy est directement inclus dans @fr
change note: Added the French and Spanish labels.
  date: 2025-04-02
change note: Introduced in RiC-O 1.1.
  date: 2025-03-04

proxy is directly included in proxy
type: ObjectProperty
sub property of: is direct part of
sub property of: proxy is included in proxy transitive
inverse of: proxy directly includes proxy
domain: Proxy
range: Proxy
comment: Connects a Proxy of a Record or Record Set to a Proxy of a Record Set which it is directly included in.
label: proxy está directamente incluido en el proxy @es
label: proxy est directement inclus dans le proxy @fr
change note: Added the French and Spanish labels.
  date: 2025-04-02
change note: Introduced in RiC-O 1.1.
  date: 2025-03-04

proxy is included in
type: ObjectProperty
sub property of: is part of transitive
inverse of: includes proxy
domain: Proxy
range: Record Set
property chain axiom: proxy is included in proxy transitive
comment: Connects a Proxy of a Record or Record Set to a Record Set which it is included in, directly or indirectly.
label: proxy está incluido en @es
label: proxy est inclus dans @fr
change note: Added the French and Spanish labels.
  date: 2025-04-02
change note: Introduced in RiC-O 1.1.
  date: 2025-03-04

proxy is included in proxy transitive
type: ObjectProperty
sub property of: is part of transitive
type: TransitiveProperty
inverse of: proxy includes proxy transitive
domain: Proxy
range: Proxy
comment: Connects a Proxy of a Record or Record Set to a Proxy of a Record Set which it is included in, directly or indirectly. This is a transitive relation.
label: proxy está incluido en el proxy (transitivo) @es
label: proxy est inclus dans le proxy (transitif) @fr
change note: Added the French and Spanish labels.
  date: 2025-04-02
change note: Introduced in RiC-O 1.1.
  date: 2025-03-04

proxy precedes in sequence
type: ObjectProperty
sub property of: precedes in sequence transitive
inverse of: follows proxy in sequence
domain: Proxy
range: Record Resource
property chain axiom: proxy precedes proxy in sequence transitive
comment: Connects a Proxy of a Record Resource to a Record Resource which the first precedes directly or indirectly in some sequence (not necessarily defined or characterised chronologically).
label: proxy précède dans la séquence @fr
label: proxy precede en la secuencia @es
change note: Added the French and Spanish labels.
  date: 2025-04-02
change note: Introduced in RiC-O 1.1.
  date: 2025-03-04

proxy precedes proxy in sequence transitive
type: ObjectProperty
sub property of: precedes in sequence transitive
type: TransitiveProperty
inverse of: proxy follows proxy in sequence transitive
domain: Proxy
range: Proxy
comment: Connects a Proxy of a Record Resource to a Proxy of another Record Resource which directly or indirectly follows the first in some sequence (not necessarily defined or characterised chronologically). This is a transitive relation.
label: proxy precede el proxy en la secuencia (transitivo) @es
label: proxy précède le proxy dans la séquence (transitif) @fr
change note: Added the French and Spanish labels.
  date: 2025-04-02
change note: Introduced in RiC-O 1.1.
  date: 2025-03-04

has the role of the Record Resource Genetic Relation
type: ObjectProperty
sub property of: has the role of the Record Resource to Record Resource Relation
domain: Record Resource Genetic Relation
range: Record Resource Genetic Relation
comment: Connects a RecordResourceGeneticRelation to itself. It is a property that can stand for an instance of the class when necessary, e.g. when you explore a knowledge graph.
label: a le rôle de la Relation génétique entre des ressources archivistiques @fr
label: desempeña el papel de la Relación genética entre recursos documentales @es
change note: Removed global reflexivity (leads to inconsistency).
  date: 2024-08-02
change note:
  date: 2023-11-08
  value: In order to get a system of rolified Relation classes: created the object property, with domain and range the RecordResourceGeneticRelation rolified class. Declared it as reflexive. Declared it(s) superproperty(ies).
scope note: This property "rolifies" the RecordResourceGeneticRelation class. It should be used only when you have to manage instances of the RecordResourceGeneticRelation class, to connect each instance to itself, in order to be able to infer, using OWL-RL and property paths, the two shortcuts corresponding to this n-ary class.

Record Resource has source of information
type: ObjectProperty
sub property of: is record resource associated with record resource
inverse of: is source of information of Record Resource
domain: Record Resource
range: Record Resource
comment: Connects a Record Resource to a Record Resource, when the second one is used as a source of information for producing the content of the first one.
label: est une ressource archivistique qui a pour source d’information @fr
label: recurso documental tiene como fuente de información @es
change note:
  date: 2025-01-17
  value: Object property added in RiC-O 1.1, with its inverse one. It replaces, as concerns Record Resources, the former 'hasSource' object property, that was available in RiC-0 0.1 and RiC-O 0.2, and was removed in RiC-O 1.0.
scope note: Can be used, for example, to connect a Record that has documentary form type Authority Record or Finding Aid, and a Record Resource used as a source of information for it. Not to be confused with the 'hasGeneticLinkToRecordResource' object property.

has the role of the Record Resource Holding Relation
type: ObjectProperty
sub property of: has the role of the Management Relation
domain: Record Resource Holding Relation
range: Record Resource Holding Relation
comment: Connects a RecordResourceHoldingRelation to itself. It is a property that can stand for an instance of the class when necessary, e.g. when you explore a knowledge graph.
label: a le rôle de la Relation entre agents et ressources archivistiques ou instanciations conservées @fr
label: desempeña el papel de la Relación entre agentes y recursos documentales que conservan @es
change note: Removed global reflexivity (leads to inconsistency).
  date: 2024-08-02
change note: Fixed a typo in the French label.
  date: 2023-12-30
change note:
  date: 2023-11-08
  value: In order to get a system of rolified Relation classes: created the object property, with domain and range the RecordResourceHoldingRelation rolified class. Declared it as reflexive. Declared it(s) superproperty(ies).
scope note: This property "rolifies" the RecordResourceHoldingRelation class. It should be used only when you have to manage instances of the RecordResourceHoldingRelation class, to connect each instance to itself, in order to be able to infer, using OWL-RL and property paths, the two shortcuts corresponding to this n-ary class.

has the role of the Record Resource to Instantiation Relation
type: ObjectProperty
sub property of: has the role of the Relation
domain: Record Resource to Instantiation Relation
range: Record Resource to Instantiation Relation
comment: Connects a RecordResourceToInstantiationRelation to itself. It is a property that can stand for an instance of the class when necessary, e.g. when you explore a knowledge graph.
label: a le rôle de la Relation d’instanciation @fr
label: desempeña el papel de la Relación de recurso documental a instanciación @es
change note: Removed global reflexivity (leads to inconsistency).
  date: 2024-08-02
change note:
  date: 2023-11-08
  value: In order to get a system of rolified Relation classes: created the object property, with domain and range the RecordResourceToInstantiationRelation rolified class. Declared it as reflexive. Declared it(s) superproperty(ies).
scope note: This property "rolifies" the RecordResourceToInstantiationRelation class. It should be used only when you have to manage instances of the RecordResourceToInstantiationRelation class, to connect each instance to itself, in order to be able to infer, using OWL-RL and property paths, the two shortcuts corresponding to this n-ary class.

has the role of the Record Resource to Record Resource Relation
type: ObjectProperty
sub property of: has the role of the Relation
domain: Record Resource to Record Resource Relation
range: Record Resource to Record Resource Relation
comment: Connects a RecordResourceToRecordResourceRelation to itself. It is a property that can stand for an instance of the class when necessary, e.g. when you explore a knowledge graph.
label: a le rôle de la Relation entre ressources archivistiques @fr
label: desempeña el papel de la Relación entre recursos documentales @es
change note: Removed global reflexivity (leads to inconsistency).
  date: 2024-08-02
change note:
  date: 2023-11-08
  value: In order to get a system of rolified Relation classes: created the object property, with domain and range the RecordResourceToRecordResourceRelation rolified class. Declared it as reflexive. Declared it(s) superproperty(ies).
scope note: This property "rolifies" the RecordResourceToRecordResourceRelation class. It should be used only when you have to manage instances of the RecordResourceToRecordResourceRelation class, to connect each instance to itself, in order to be able to infer, using OWL-RL and property paths, the two shortcuts corresponding to this n-ary class.

regulates or regulated
type: ObjectProperty
sub property of: is rule associated with
inverse of: is or was regulated by
domain: Rule
range: Thing
comment: Connects a Rule to a Thing that it regulates or regulated.
label: regula o regulaba @es
label: régule ou a régulé @fr
change note: Added a new rdfs:label in Spanish.
  date: 2023-11-02
change note: Added a new rdfs:label in French.
  date: 2023-08-28
change note: changed the IRI, label, inverse property IRI (changed made in order to make RiC-O compliant with RiC-CM 0.2; the name of this property in RiC-O 0.1 was "regulates").
  date: 2021-01-22
RiC-CM corresponding component: RiC-R063 ('regulates or regulated' relation)

relation connects
type: ObjectProperty
sub property of: is related to
inverse of: thing is connected to relation
domain: Relation
range: Thing
comment: Connects an n-ary Relation to any of the Things involved.
label: relación conecta @es
label: relation connecte @fr
change note: Added a new rdfs:label in Spanish.
  date: 2023-11-02
change note: Added a new rdfs:label in French.
  date: 2023-08-28

relation has context
type: ObjectProperty
sub property of: relation connects
inverse of: thing is context of relation
domain: Relation
range: Thing
comment: Connects an n-ary Relation to a Thing that is a secondary, contextual entity during the existence of the Relation.
label: relación tiene como contexto @es
label: relation a pour contexte @fr
change note: Added a new rdfs:label in Spanish.
  date: 2023-11-02
change note: Added a new rdfs:label in French.
  date: 2023-08-28
scope note: The secondary entity may be, for instance, a Position or a Role Type.

relation has date
type: ObjectProperty
sub property of: is associated with date
sub property of: relation has context
inverse of: is date associated with Relation
domain: Relation
range: Date
comment: Connects an n-ary Relation to a Date.
label: relación tiene como fecha @es
label: relation a pour date @fr
change note: Added French and Spanish labels.
  date: 2025-03-13
change note: Added in RiC-O 1.1.
  date: 2024-12-19

relation has source
type: ObjectProperty
sub property of: relation connects
inverse of: thing is source of relation
domain: Relation
range: Thing
comment: Connects an n-ary Relation to a Thing that is its source.
label: relación tiene como fuente @es
label: relation a pour source @fr
change note: Added a new rdfs:label in Spanish.
  date: 2023-11-02
change note: Added a new rdfs:label in French.
  date: 2023-08-28

relation has target
type: ObjectProperty
sub property of: relation connects
inverse of: thing is target of relation
domain: Relation
range: Thing
comment: Connects an n-ary Relation to a Thing that is its target.
label: relación tiene como objetivo @es
label: relation a pour cible @fr
change note: Added a new rdfs:label in Spanish.
  date: 2023-11-02
change note: Added a new rdfs:label in French.
  date: 2023-08-28

has the role of the Relation
type: ObjectProperty
domain: Relation
range: Relation
comment: Connects a Relation to itself. It is a property that can stand for an instance of the class when necessary, e.g. when you explore a knowledge graph.
label: a le rôle de la Relation @fr
label: desempeña el papel de la Relación @es
change note: Removed global reflexivity (leads to inconsistency).
  date: 2024-08-02
change note: In order to get a system of rolified Relation classes: created the object property, with domain and range the Relation rolified class. Declared it as reflexive.
  date: 2023-11-08
scope note: This property "rolifies" the generic Relation class. It should be used only when you have to manage instances of this Relation class, to connect each instance to itself, in order to be able to infer, using OWL-RL and property paths, the two shortcuts corresponding to this n-ary class.

resulted from the merger of
type: ObjectProperty
sub property of: is successor of
inverse of: was merged into
domain: Corporate Body
range: Corporate Body
comment: Inverse of 'was merged into' object property.
label: resultado de la fusión de @es
label: résulte de la fusion de @fr
change note: Make capitalisation of rdfs:comment consistent.
  date: 2024-03-15
change note: Updated the labels.
  date: 2023-11-12
change note: Added a new rdfs:label in Spanish.
  date: 2023-11-02
change note: Object property created in order to enable an accurate representation of mergers between corporate bodies.
  date: 2023-06-21

resulted from the split of
type: ObjectProperty
sub property of: is successor of
inverse of: was split into
domain: Corporate Body
range: Corporate Body
comment: Inverse of 'was split into' object property.
label: resultado de la separación de @es
label: résulte de la séparation de @fr
change note: Updated the labels.
  date: 2023-11-12
change note: Added a new rdfs:label in Spanish.
  date: 2023-11-02
change note: Object property created in order to enable an accurate representation of the split of a corporate body into two or more new corporate bodies.
  date: 2023-06-21

results or resulted from
type: ObjectProperty
sub property of: is associated with event
inverse of: results or resulted in
domain: Thing
range: Event
comment: Inverse of 'results or resulted in' object property.
label: resulta o resultaba @es
label: résulte ou a résulté de @fr
change note: Added a new rdfs:label in Spanish.
  date: 2023-11-02
change note: Added a new rdfs:label in French.
  date: 2023-08-28
change note: changed the IRI, label, inverse property IRI, text definition (changed made in order to make RiC-O compliant with RiC-CM 0.2; the name of this property in RiC-O 0.1 was "resultsFrom").
  date: 2021-01-22
RiC-CM corresponding component: RiC-R061i ('results or resulted from' relation)

results or resulted in
type: ObjectProperty
sub property of: is event associated with
inverse of: results or resulted from
domain: Event
range: Thing
comment: Connects an Event to a Thing that results or resulted from the Event.
label: a ou a eu pour résultat @fr
label: tiene o tenía como resultado a @es
change note: Added a new rdfs:label in Spanish.
  date: 2023-11-02
change note: Added a new rdfs:label in French.
  date: 2023-08-28
change note: changed the IRI, label, inverse property IRI, text definition (changed made in order to make RiC-O compliant with RiC-CM 0.2; the name of this property in RiC-O 0.1 was "resultsIn").
  date: 2021-01-22
RiC-CM corresponding component: RiC-R061 ('results or resulted in' relation)

role is context of creation relation
type: ObjectProperty
sub property of: thing is context of relation
inverse of: creation with role
domain: Role Type
range: Creation Relation
comment: Connects a Role Type to a Creation Relation (this Role Type being the specific role played by the creating Person in the context of this Relation).
label: rôle est le contexte de la relation de création @fr
label: rol es contexto de relación de creación @es
change note: Added a new rdfs:label in Spanish.
  date: 2023-11-02
change note: Added a new rdfs:label in French.
  date: 2023-08-28

has the role of the Rule Relation
type: ObjectProperty
sub property of: has the role of the Relation
domain: Rule Relation
range: Rule Relation
comment: Connects a RuleRelation to itself. It is a property that can stand for an instance of the class when necessary, e.g. when you explore a knowledge graph.
label: a le rôle de la Relation impliquant une règle @fr
label: desempeña el papel de la Relación con regla @es
change note: Removed global reflexivity (leads to inconsistency).
  date: 2024-08-02
change note: In order to get a system of rolified Relation classes: created the object property, with domain and range the RuleRelation rolified class. Declared it as reflexive. Declared it(s) superproperty(ies).
  date: 2023-11-08
scope note: This property "rolifies" the RuleRelation class. It should be used only when you have to manage instances of the RuleRelation class, to connect each instance to itself, in order to be able to infer, using OWL-RL and property paths, the two shortcuts corresponding to this n-ary class.

has the role of the Sequential Relation
type: ObjectProperty
sub property of: has the role of the Relation
domain: Sequential Relation
range: Sequential Relation
comment: Connects a SequentialRelation to itself. It is a property that can stand for an instance of the class when necessary, e.g. when you explore a knowledge graph.
label: a le rôle de la Relation séquentielle @fr
label: desempeña el papel de la Relación secuencial @es
change note: Removed global reflexivity (leads to inconsistency).
  date: 2024-08-02
change note:
  date: 2023-11-08
  value: In order to get a system of rolified Relation classes: created the object property, with domain and range the SequentialRelation rolified class. Declared it as reflexive. Declared it(s) superproperty(ies).
scope note: This property "rolifies" the SequentialRelation class. It should be used only when you have to manage instances of the SequentialRelation class, to connect each instance to itself, in order to be able to infer, using OWL-RL and property paths, the two shortcuts corresponding to this n-ary class.

has the role of the Sibling Relation
type: ObjectProperty
sub property of: has the role of the Family Relation
domain: Sibling Relation
range: Sibling Relation
comment: Connects a SiblingRelation to itself. It is a property that can stand for an instance of the class when necessary, e.g. when you explore a knowledge graph.
label: a le rôle de la Relation de fratrie @fr
label: desempeña el papel de la Relación familiar entre hermanos @es
change note: Removed global reflexivity (leads to inconsistency).
  date: 2024-08-02
change note:
  date: 2023-11-08
  value: In order to get a system of rolified Relation classes: created the object property, with domain and range the SiblingRelation rolified class. Declared it as reflexive. Declared it(s) superproperty(ies).
scope note: This property "rolifies" the SiblingRelation class. It should be used only when you have to manage instances of the SiblingRelation class, to connect each instance to itself, in order to be able to infer, using OWL-RL and property paths, the two shortcuts corresponding to this n-ary class.

has the role of the Spouse Relation
type: ObjectProperty
sub property of: has the role of the Family Relation
domain: Spouse Relation
range: Spouse Relation
comment: Connects a SpouseRelation to itself. It is a property that can stand for an instance of the class when necessary, e.g. when you explore a knowledge graph.
label: a le rôle de la Relation matrimoniale @fr
label: desempeña el papel de la Relación matrimonial entre personas @es
change note: Removed global reflexivity (leads to inconsistency).
  date: 2024-08-02
change note:
  date: 2023-11-08
  value: In order to get a system of rolified Relation classes: created the object property, with domain and range the SpouseRelation rolified class. Declared it as reflexive. Declared it(s) superproperty(ies).
scope note: This property "rolifies" the SpouseRelation class. It should be used only when you have to manage instances of the SpouseRelation class, to connect each instance to itself, in order to be able to infer, using OWL-RL and property paths, the two shortcuts corresponding to this n-ary class.

studies or studied at
type: ObjectProperty
sub property of: is or was member of
inverse of: is or was attended by student
domain: Person
range: Group
property chain axiom: thing is target of relation
property chain axiom: has the role of the Study At Relation
property chain axiom: relation has source
comment: Connects a Person to an educational institution at which they studied or study. Both 'institution' and 'at' can be interpreted broadly.
label: estudia o estudió en @es
label: étudie ou a étudié à @fr
change note: Added the French and Spanish labels.
  date: 2024-12-23
change note: Added in RiC-O 1.1.
  date: 2024-12-19

has the role of the Study At Relation
type: ObjectProperty
sub property of: has the role of the Membership Relation
domain: Study At Relation
range: Study At Relation
comment: Connects a StudyAtRelation to itself. It is a property that can stand for an instance of the class when necessary, e.g. when you explore a knowledge graph.
label: a le rôle de la Relation entre institution d’enseignement et étudiants @fr
label: desempeña el papel de la Relación entre institución educativa y estudiantes @es
change note: Added the French and Spanish labels.
  date: 2024-12-23
change note: Added in RiC-O 1.1.
  date: 2024-12-19

has the role of the Teaching Relation
type: ObjectProperty
sub property of: has the role of the Knowing Relation
domain: Teaching Relation
range: Teaching Relation
comment: Connects a TeachingRelation to itself. It is a property that can stand for an instance of the class when necessary, e.g. when you explore a knowledge graph.
label: a le rôle de la Relation entre enseignants et étudiants @fr
label: desempeña el papel de la Relación académica entre profesor y alumno @es
change note: Removed global reflexivity (leads to inconsistency).
  date: 2024-08-02
change note:
  date: 2023-11-08
  value: In order to get a system of rolified Relation classes: created the object property, with domain and range the TeachingRelation rolified class. Declared it as reflexive. Declared it(s) superproperty(ies).
scope note: This property "rolifies" the TeachingRelation class. It should be used only when you have to manage instances of the TeachingRelation class, to connect each instance to itself, in order to be able to infer, using OWL-RL and property paths, the two shortcuts corresponding to this n-ary class.

has the role of the Temporal Relation
type: ObjectProperty
sub property of: has the role of the Sequential Relation
domain: Temporal Relation
range: Temporal Relation
comment: Connects a TemporalRelation to itself. It is a property that can stand for an instance of the class when necessary, e.g. when you explore a knowledge graph.
label: a le rôle de la Relation temporelle @fr
label: desempeña el papel de la Relación temporal @es
change note: Removed global reflexivity (leads to inconsistency).
  date: 2024-08-02
change note:
  date: 2023-11-08
  value: In order to get a system of rolified Relation classes: created the object property, with domain and range the TemporalRelation rolified class. Declared it as reflexive. Declared it(s) superproperty(ies).
scope note: This property "rolifies" the TemporalRelation class. It should be used only when you have to manage instances of the TemporalRelation class, to connect each instance to itself, in order to be able to infer, using OWL-RL and property paths, the two shortcuts corresponding to this n-ary class.

thing is connected to relation
type: ObjectProperty
sub property of: is related to
inverse of: relation connects
domain: Thing
range: Relation
comment: Connects a Thing to an n-ary Relation.
label: chose est connectée à la relation @fr
label: cosa está conectada con relación @es
change note: Fixed a typo in the French label.
  date: 2023-12-30
change note: Updated the labels.
  date: 2023-11-12
change note: Added a new rdfs:label in Spanish.
  date: 2023-11-02

thing is context of relation
type: ObjectProperty
sub property of: thing is connected to relation
inverse of: relation has context
domain: Thing
range: Relation
comment: Connects a Thing (that is a secondary, contextual entity during the existence of the Relation) to an n-ary Relation.
label: chose est le contexte de la relation @fr
label: cosa es contexto de relación @es
change note: Updated the labels.
  date: 2023-11-12
change note: Added a new rdfs:label in Spanish.
  date: 2023-11-02

thing is source of relation
type: ObjectProperty
sub property of: thing is connected to relation
inverse of: relation has source
domain: Thing
range: Relation
comment: Connects a Thing (that is the source of a Relation) to a Relation.
label: chose est la source de la relation @fr
label: cosa es fuente de relación @es
change note: Added a new rdfs:label in Spanish.
  date: 2023-11-27
change note: Updated the labels.
  date: 2023-11-12

thing is target of relation
type: ObjectProperty
sub property of: thing is connected to relation
inverse of: relation has target
domain: Thing
range: Relation
comment: Connects a Thing (that is the target of a Relation) to an n-ary Relation.
label: chose est la cible de la relation @fr
label: cosa es objetivo de relación @es
change note: Added a new rdfs:label in Spanish.
  date: 2023-11-27
change note: Updated the description (rdfs:comment) and labels.
  date: 2023-11-12

has the role of the Type Relation
type: ObjectProperty
sub property of: has the role of the Relation
domain: Type Relation
range: Type Relation
comment: Connects a TypeRelation to itself. It is a property that can stand for an instance of the class when necessary, e.g. when you explore a knowledge graph.
label: a le rôle de la Relation de catégorisation @fr
label: desempeña el papel de la Tipo de relación @es
change note: Removed global reflexivity (leads to inconsistency).
  date: 2024-08-02
change note: In order to get a system of rolified Relation classes: created the object property, with domain and range the TypeRelation rolified class. Declared it as reflexive. Declared it(s) superproperty(ies).
  date: 2023-11-08
scope note: This property "rolifies" the TypeRelation class. It should be used only when you have to manage instances of the TypeRelation class, to connect each instance to itself, in order to be able to infer, using OWL-RL and property paths, the two shortcuts corresponding to this n-ary class.

was component of
type: ObjectProperty
sub property of: is or was component of
sub property of: was part of
inverse of: had component
domain: Instantiation
range: Instantiation
comment: Connects an Instantiation to another Instantiation of which it was a component in the past.
label: a été le composant de @fr
label: era componente de @es
change note: Added a new rdfs:label in Spanish.
  date: 2023-11-27
change note: Updated the description (rdfs:comment) and labels.
  date: 2023-11-12
change note:
  date: 2023-09-08
  value: Object property added, along with its inverse property, in order to enable to express past partitive relations between instantiations (the current partitive relations being also added, including a transitive one).

was constituent of
type: ObjectProperty
sub property of: is or was constituent of
sub property of: was part of
inverse of: had constituent
domain: Class
  union of: Documento
  union of: Record Part
range: Class
  union of: Documento
  union of: Record Part
comment: Connects a Record or Record Part to another Record or Record Part of which it was a constituent in the past.
label: a été un constituant de @fr
label: era elemento constitutivo de @es
change note: Added a new rdfs:label in Spanish.
  date: 2023-11-27
change note: Updated the labels.
  date: 2023-11-12
change note: Added RecordPart to the range.
  date: 2023-10-26
change note:
  date: 2023-09-08
  value: Object property added, along with its inverse property, in order to enable to express past partitive relations between Record and Record or Record Part (the current partitive relations being also added, including a transitive one).

was contained by
type: ObjectProperty
sub property of: is or was contained by
sub property of: was part of
inverse of: contained
domain: Place
range: Place
comment: Connects a Place to a Place within which it was contained.
label: a été contenu par @fr
label: estaba contenido en @es
change note: Added a new rdfs:label in Spanish.
  date: 2023-11-27
change note: Updated the description (rdfs:comment) and labels.
  date: 2023-11-12
change note:
  date: 2023-09-08
  value: Object property added, along with its inverse property, in order to enable to express past partitive relations between places (the current partitive relations being also added, including a transitive one).

was included in
type: ObjectProperty
sub property of: is or was included in
sub property of: was part of
inverse of: included
domain: Class
  union of: Documento
  union of: Record Set
range: Record Set
comment: Connects a Record to a Record or Record Set in which it was included in the past.
label: a été inclus dans @fr
label: estaba incluido en @es
change note: Added a new rdfs:label in Spanish.
  date: 2023-11-27
change note: Updated the labels.
  date: 2023-11-12
change note:
  date: 2023-09-08
  value: Object property added, along with its inverse property, in order to enable to express past partitive relations between Record Sets and their members (the current partitive relations being also added, including a transitive one).

was last updated at date
type: ObjectProperty
sub property of: has modification date
inverse of: is last update date of
domain: Thing
range: Date
comment: Connects a Thing to the Date when it was last modified.
label: a pour date de dernière mise à jour @fr
label: fue actualizado por última vez en fecha @es
change note: Added a new rdfs:label in Spanish.
  date: 2023-11-02
change note: Added a new rdfs:label in French.
  date: 2023-08-28

was merged into
type: ObjectProperty
sub property of: has successor
inverse of: resulted from the merger of
domain: Corporate Body
range: Corporate Body
comment: Connects a Corporate Body to another Corporate Body that is the result of a merger of the previous one with one to many other corporate bodies.
label: a été fusionné dans @fr
label: se fusionó en @es
change note: Updated the labels.
  date: 2023-11-12
change note: Added a new rdfs:label in Spanish.
  date: 2023-11-02
change note: Object property created in order to enable an accurate representation of mergers between corporate bodies.
  date: 2023-06-21

was part of
type: ObjectProperty
sub property of: is or was part of
inverse of: had part
domain: Thing
range: Thing
comment: Connects a Thing to a Thing of which it was a constitutive or component part in the past.
label: a fait partie de @fr
label: era parte de @es
change note: Added a new rdfs:label in Spanish.
  date: 2023-11-27
change note: Updated the labels.
  date: 2023-11-12
change note:
  date: 2023-07-12
  value: Object property added, along with its inverse property, in order to enable to express past partitive relations between things (the current partitive relations being also added, including a transitive one).

was split into
type: ObjectProperty
sub property of: has successor
inverse of: resulted from the split of
domain: Corporate Body
range: Corporate Body
comment: Connects a Corporate Body to one of the Corporate Bodies that results from the split of the previous one into two to many corporate bodies.
label: a été séparé en @fr
label: se separó en @es
change note: Updated the labels.
  date: 2023-11-12
change note: Added a new rdfs:label in Spanish.
  date: 2023-11-02
change note: Object property created in order to enable an accurate representation of the split of a corporate body into two or more new corporate bodies.
  date: 2023-06-21

was subdivision of
type: ObjectProperty
sub property of: is or was subdivision of
sub property of: was part of
sub property of: was subordinate to
inverse of: had subdivision
domain: Group
range: Group
comment: Connects a subdivision to the Group it was a part of in the past.
label: a été une subdivision de @fr
label: era subdivisión de @es
change note: Added a new rdfs:label in Spanish.
  date: 2023-11-27
change note: Updated the labels.
  date: 2023-11-12
change note:
  date: 2023-09-08
  value: Object property added, along with its inverse property, in order to enable to express past partitive relations between Groups (the current partitive relations being also added, including a transitive one).

was subevent of
type: ObjectProperty
sub property of: is or was subevent of
sub property of: was part of
inverse of: had subevent
domain: Event
range: Event
comment: Connects a past Event to the broader Event of which it was a part.
label: a été un événement constitutif de l'événement @fr
label: era parte de evento de @es
change note: Added a new rdfs:label in Spanish.
  date: 2023-11-27
change note: Updated the labels.
  date: 2023-11-12
change note:
  date: 2023-09-08
  value: Object property added, along with its inverse property, in order to enable to express partitive relations between past Events (the partitive relations between ongoing events being also added, including a transitive one).

was subordinate to
type: ObjectProperty
sub property of: is or was subordinate to
inverse of: had subordinate
domain: Agent
range: Agent
comment: Connects an Agent to an Agent that was hierarchically superior in the past.
label: a été subalterne de @fr
label: estaba subordinado(a) a @es
change note: Added a new rdfs:label in Spanish.
  date: 2023-11-27
change note: Updated the labels.
  date: 2023-11-12
change note:
  date: 2023-09-08
  value: Object property added, along with its inverse property, in order to enable to express past subordination relations between Agents (the current subordination relations being also added, including a transitive one).

was used from date
type: ObjectProperty
sub property of: has beginning date
inverse of: is from use date of
domain: Appellation
range: Date
comment: Connects an Appellation to the Date from which it was used.
label: a été utilisé à partir de la date @fr
label: fue usado desde @es
change note: Added a new rdfs:label in Spanish.
  date: 2023-11-02
change note: Made this property subPropertyOf hasBeginningDate.
  date: 2023-10-19
change note: Added a new rdfs:label in French.
  date: 2023-08-28

was used to date
type: ObjectProperty
sub property of: has end date
inverse of: is to use date of
domain: Appellation
range: Date
comment: Connects an Appellation to the Date till when it was used.
label: a été utilisé jusqu’à la date @fr
label: fue usado hasta @es
change note: Added a new rdfs:label in Spanish.
  date: 2023-11-02
change note: Made this property subPropertyOf hasEndDate.
  date: 2023-10-19
change note: Added a new rdfs:label in French.
  date: 2023-08-28

has the role of the Whole Part Relation
type: ObjectProperty
sub property of: has the role of the Relation
domain: Whole Part Relation
range: Whole Part Relation
comment: Connects a WholePartRelation to itself. It is a property that can stand for an instance of the class when necessary, e.g. when you explore a knowledge graph.
label: a le rôle de la Relation partitive @fr
label: desempeña el papel de la Relación entre todo y parte @es
change note: Removed global reflexivity (leads to inconsistency).
  date: 2024-08-02
change note:
  date: 2023-11-08
  value: In order to get a system of rolified Relation classes: created the object property, with domain and range the WholePartRelation rolified class. Declared it as reflexive. Declared it(s) superproperty(ies).
scope note: This property "rolifies" the WholePartRelation class. It should be used only when you have to manage instances of the WholePartRelation class, to connect each instance to itself, in order to be able to infer, using OWL-RL and property paths, the two shortcuts corresponding to this n-ary class.

has the role of the Work Relation
type: ObjectProperty
sub property of: has the role of the Agent Relation
domain: Work Relation
range: Work Relation
comment: Connects a WorkRelation to itself. It is a property that can stand for an instance of the class when necessary, e.g. when you explore a knowledge graph.
label: a le rôle de la Relation de travail @fr
label: desempeña el papel de la Relación profesional @es
change note: Removed global reflexivity (leads to inconsistency).
  date: 2024-08-02
change note: In order to get a system of rolified Relation classes: created the object property, with domain and range the WorkRelation rolified class. Declared it as reflexive. Declared it(s) superproperty(ies).
  date: 2023-11-08
scope note: This property "rolifies" the WorkRelation class. It should be used only when you have to manage instances of the WorkRelation class, to connect each instance to itself, in order to be able to infer, using OWL-RL and property paths, the two shortcuts corresponding to this n-ary class.

accruals
type: DatatypeProperty
domain: Record Set
range: Literal
comment: Information on the anticipated accession(s) to the Record Set.
label: accroissements @fr
label: ingresos @es
change note: Aligned with RiC-CM 1.0: updated the IRI, mapping to RiC-CM (rico:RiCCMCorrespondingComponent), labels, skos:scopeNote, examples (skos:example).
  date: 2023-11-11
change note: Added a new rdfs:label in Spanish.
  date: 2023-11-02
change note: Added a new rdfs:label in French.
  date: 2023-08-25
example: Accruing - there is an agreement with the creator that additional snapshots of their email directory will be accessioned at yearly intervals
example: Non-accruing
example: Unknown
scope note: See also accrualsStatus
RiC-CM corresponding component: corresponds to RiC-A01 (Accruals attribute)

accruals status
type: DatatypeProperty
domain: Record Set
range: Literal
comment: Information on the status of possible accruals
label: estado de los ingresos @es
label: statut des accroissements @fr
change note: Aligned with RiC-CM 1.0: updated the IRI, mapping to RiC-CM (rico:RiCCMCorrespondingComponent), labels, description (rdfs:comment), skos:scopeNote.
  date: 2023-11-11
change note: Added a new rdfs:label in Spanish.
  date: 2023-11-02
change note: Added a new rdfs:label in French.
  date: 2023-08-25
change note: scope note : updated. Objective: to make RiC-O compliant with RiC-CM v0.2.
  date: 2020-11-01
scope note: A text statement or single words such as “Closed” to indicate that no additional Record Resource will (or is anticipated to) be added to the Record Set; “Open” to indicate that additional records or record sets will (or are expected to) be added to the Record Set; or “Unknown” to indicate that this information is not available, for example. See also accruals
RiC-CM corresponding component: specialization of RiC-A01 (Accruals attribute)

accumulation date
type: DatatypeProperty
sub property of: date
domain: Class
  union of: Instantiation
  union of: Record Resource
range: Literal
comment: A date at which a Record Resource or Instantiation was or will be accumulated.
label: date d’accumulation @fr
label: fecha de acumulación @es
change note: Changed definition (added "or will be").
  date: 2025-02-19
change note: Added in RiC-O 1.1.
  date: 2024-12-19
scope note: Datatype property analogue of 'hasAccumulationDate', which is provided for usability reasons. May be deprecated and removed later on. Use only if you don’t use Date classes for handling dates.

all members with accumulation date
type: DatatypeProperty
sub property of: date
domain: Record Set
range: Literal
comment: Date at which all of the present or past members of a Record Set were or will be accumulated.
label: des membres ayant tous pour date d’accumulation @fr
label: todos sus miembros como fecha de acumulación @es
change note: Changed definition (added "or will be").
  date: 2025-02-19
change note: Added in RiC-O 1.1.
  date: 2024-12-19
scope note: Datatype property analogue of 'hasOrHadAllMembersWithAccumulationDate', which is provided for usability reasons. May be deprecated and removed later on. Use only if you don’t use Date classes for handling dates.

all members with creation date
type: DatatypeProperty
sub property of: beginning date
domain: Record Set
range: Literal
comment: Date at which all of the present or past members of a Record Set were or will be created.
label: des membres ayant tous pour date de création @fr
label: todos sus miembros como fecha de creación @es
change note: Changed definition (added "or will be").
  date: 2025-02-19
change note: Added in RiC-O 1.1.
  date: 2024-12-19
scope note: Datatype property analogue of 'hasOrHadAllMembersWithCreationDate', which is provided for usability reasons. May be deprecated and removed later on. Use only if you don’t use Date classes for handling dates.
RiC-CM corresponding component: RiC-R081i ('has or had all members with creation date' relation).

altimetric system
type: DatatypeProperty
sub property of: reference system
domain: Coordinates
range: Literal
comment: Reference system used for altitude
label: sistema altimétrico @es
label: système altimétrique @fr
change note: Added a new rdfs:label in Spanish.
  date: 2023-11-02
change note: Added a new rdfs:label in French.
  date: 2023-08-25

altitude
type: DatatypeProperty
sub property of: measure
domain: Coordinates
range: Literal
comment: The height of a Place above a reference level, especially above sea level.
label: altitud @es
change note: Added a new rdfs:label in Spanish.
  date: 2023-11-02
change note: Added a new rdfs:label in French.
  date: 2023-08-25
scope note: Property of the Coordinates class. If you don't use this class, use geographicalCoordinates property, a property of Place class.

authenticity note
type: DatatypeProperty
sub property of: note
domain: Class
  union of: Instantiation
  union of: Record Resource
range: Literal
comment: Information on the evidence that a Record Resource or Instantiation is what it purports to be, was created or sent by the said Agent at the said time, and has not been tampered with, corrupted, or forged.
label: nota de autenticidad @es
label: note sur l’authenticité @fr
change note: Made this property a subproperty of the new rico:note datatype property. Slightly modified its definition (rdfs:comment).
  date: 2025-01-17
change note: Aligned with RiC-CM 1.0: updated the description (rdfs:comment), skos:scopeNote, examples (skos:example).
  date: 2023-11-11
change note: Added a new rdfs:label in Spanish.
  date: 2023-11-02
change note: Added a new rdfs:label in French.
  date: 2023-08-25
change note: examples added. Objective: to make RiC-O compliant with RiC-CM v0.2.
  date: 2020-11-01
example: The deed is digitally signed by the Notary. The electronic signature validity cannot be assessed, but the content was not modified from the moment of signing.
example: The letter is unsigned.
example: The record bears signatures.
example: The timestamp exists but cannot be verified.
scope note: May be used in a Record Set description when its value is shared by some or all members of the Record Set. For digital records, it may include results from automated means of checking the validity of signatures and timestamp. In particular cases it may be contextually related to the state attribute, for example, a document can be an original or a copy, either of which can be authentic or a forgery.
RiC-CM corresponding component: Corresponds to RiC-A03 (Authenticity Note attribute)

authorizing mandate
type: DatatypeProperty
sub property of: rule followed
domain: Agent
range: Literal
comment: Information on a Mandate that authorizes an Agent to perform an Activity.
label: mandat @fr
label: norma de control @es
change note: Added a new rdfs:label in Spanish.
  date: 2023-11-02
change note: Added a new rdfs:label in French.
  date: 2023-08-25
scope note: Provided for usability reasons. May be deprecated and removed later on. Use only if you don't use the Mandate class for handling mandates.

beginning date
type: DatatypeProperty
sub property of: date
domain: Thing
range: Literal
comment: Date at which something began.
label: date de début @fr
label: fecha de inicio @es
change note: Added a new rdfs:label in Spanish.
  date: 2023-11-02
change note: Added a new rdfs:label in French.
  date: 2023-08-25
scope note: Provided for usability reasons. May be deprecated and removed later on. Use only if you don't use Date classes for handling dates.
RiC-CM corresponding component: Datatype property specialized implementation of RiC-E18 (Date entity)

birth date
type: DatatypeProperty
sub property of: beginning date
domain: Person
range: Literal
comment: Date at which a Person was born.
label: date de naissance @fr
label: fecha de nacimiento @es
change note: Added a new rdfs:label in Spanish.
  date: 2023-11-02
change note: Added a new rdfs:label in French.
  date: 2023-08-25
scope note: Provided for usability reasons. May be deprecated and removed later on. Use only if you don't use Date classes for handling dates.
RiC-CM corresponding component: Datatype property specialized implementation of RiC-E18 (Date entity)

carrier extent
type: DatatypeProperty
sub property of: physical or logical extent
domain: Instantiation
range: Literal
comment: Number of physical units and/or physical dimensions of the carrier of an Instantiation. In order to manage an Instantiation of a record resource it is necessary to note the extent of the carrier as well as that of the Instantiation itself. Whether it is necessary to note dimensions, the number of relevant units, or both, depends on the nature of the carrier and particular business needs.
label: extensión del soporte @es
label: mesure du support @fr
change note: Aligned with RiC-CM 1.0: updated the description (rdfs:comment), skos:scopeNote, examples (skos:example).
  date: 2023-11-11
change note: Added a new rdfs:label in Spanish.
  date: 2023-11-02
change note: Added a new rdfs:label in French.
  date: 2023-08-25
change note: Text definition and scope note updated. Examples added. Objective: to make RiC-O compliant with RiC-CM v0.2.
  date: 2020-11-01
example: 1 page
example: 3 GB (1 USB key)
example: 32.5 x 49 cm (piece of parchment)
scope note: For digital resources, it may be used to indicate the size of storage capacity (disk, tape, film, etc.). Carrier extent should not be confused with instantiation extent or record resource extent. For a given Record Resource, the instantiation extent may vary, based on format, density of information on the carrier, etc. For example, a CD with a storage capacity of 700 MB (carrier extent) might hold a record of 1500 words (record resource extent) represented in two versions, one a Word document with an instantiation extent of 3 KB and the other a PDF file with an instantiation extent of 5 KB.
RiC-CM corresponding component: Corresponds to RiC-A04 (Carrier Extent attribute)

classification
type: DatatypeProperty
domain: Record Resource
range: Literal
comment: A term, number or alphanumeric string that is usually taken from an external classification vocabulary or scheme that qualifies a Record Resource.
label: clasificación @es
change note: Aligned with RiC-CM 1.0: updated the description (rdfs:comment), skos:scopeNote, examples (skos:example).
  date: 2023-11-11
change note: Added a new rdfs:label in Spanish.
  date: 2023-11-02
change note: Added a new rdfs:label in French.
  date: 2023-08-25
change note: Text definition and scope note updated. Examples added. Objective: to make RiC-O compliant with RiC-CM v0.2.
  date: 2020-11-01
example: BUD-01-F002 (classification number from a corporate file plan)
example: digitized items
example: financial affairs
example: human resource management
example: student registration
scope note: May be used in a Record Set description when its value is shared by some or all members of the record set. This datatype property is not to be confused with Identifier although, in some cases, the information may be the same.
RiC-CM corresponding component: Corresponds to RiC-A07 (Classification attribute)

conditions of access
type: DatatypeProperty
domain: Class
  union of: Instantiation
  union of: Record Resource
range: Literal
comment: Terms and circumstances affecting the availability of a Record Resource or an Instantiation for consultation.
label: condiciones de acceso @es
label: conditions d’accès @fr
change note: Aligned with RiC-CM 1.0: updated the description (rdfs:comment), skos:scopeNote, examples (skos:example).
  date: 2023-11-11
change note: Added a new rdfs:label in Spanish.
  date: 2023-11-02
change note: Added a new rdfs:label in French.
  date: 2023-08-25
change note: Text definition and scope note updated. Examples added. Objective: to make RiC-O compliant with RiC-CM v0.2.
  date: 2020-11-01
example: Acceso libre a través de los terminales de consulta @es
example: Closed as awaiting conservation treatment
example: Closed for 30 years
example: Closed under data protection legislation
example: Open
example: Recognita software, min. version 3.0, is needed in order to open the file
example: The Archives cannot provide VHS reader to access the content of the tape
scope note: May be used in a Record Set description when its value is shared by some or all members of the Record Set. The attribute provides information about the accessibility of a Record Resource, as well as the physical, technical or legal limitations that exist for providing access to it.
RiC-CM corresponding component: Corresponds to RiC-A08 (Conditions of Access attribute)

conditions of use
type: DatatypeProperty
domain: Class
  union of: Instantiation
  union of: Record Resource
range: Literal
comment: Terms and circumstances affecting the use of a Record Resource or an Instantiation after access has been provided. Includes conditions governing reproduction of the Record Resource under applicable copyright (intellectual property) and/or property legislation or due to conservation status.
label: condiciones de uso @es
label: conditions d’utilisation @fr
change note: Aligned with RiC-CM 1.0: updated the description (rdfs:comment), skos:scopeNote, examples (skos:example).
  date: 2023-11-11
change note: Added a new rdfs:label in Spanish.
  date: 2023-11-02
change note: Added a new rdfs:label in French.
  date: 2023-08-25
change note: Text definition updated. Examples added. Objective: to make RiC-O compliant with RiC-CM v0.2.
  date: 2020-11-01
example: Cannot be copied using warm light copying machines or photographed using flashlight
example: Permission of the copyright owner must be obtained before use
scope note: May be used in a Record Set description when its value is shared by some or all members of the Record Set.
RiC-CM corresponding component: Corresponds to RiC-A09 (Conditions of Use attribute)

creation date
type: DatatypeProperty
sub property of: beginning date
domain: Class
  union of: Instantiation
  union of: Record Resource
range: Literal
comment: Date at which a Record Resource or Instantiation was or will be created.
label: date de création @fr
label: fecha de creación @es
change note: Changed definition (added "or will be").
  date: 2025-02-19
change note: Narrowed the domain to match 'hasCreationDate'.
  date: 2024-12-19
change note: Added a new rdfs:label in Spanish.
  date: 2023-11-02
change note: Added a new rdfs:label in French.
  date: 2023-08-25
scope note: Provided for usability reasons. May be deprecated and removed later on. Use only if you don't use Date classes for handling dates.
RiC-CM corresponding component: Datatype property specialized implementation of RiC-E18 (Date entity)

date
type: DatatypeProperty
domain: Thing
range: Literal
comment: Chronological information associated with an entity that contributes to its identification and contextualization.
label: fecha @es
change note: Added a new rdfs:label in Spanish.
  date: 2023-11-02
change note: Added a new rdfs:label in French.
  date: 2023-08-25
scope note: Provided for usability reasons, like its subproperties. May be deprecated and removed later on. Use only if you don't use Date classes for handling dates.
RiC-CM corresponding component: Datatype property implementation of RiC-E18 (Date entity)

date qualifier
type: DatatypeProperty
domain: Date
range: Literal
comment: A human readable qualification of a Date to indicate the level of precision or certainty.
label: calificador de fecha @es
label: qualificatif de la date @fr
change note: Aligned with RiC-CM 1.0: updated the description (rdfs:comment), skos:scopeNote.
  date: 2023-11-11
change note: Added a new rdfs:label in Spanish.
  date: 2023-11-02
change note: Updated the rdfs:comment, skos:scopeNote and examples, in order to make this datatype property fully compliant with RiC-CM 1.0
  date: 2023-10-10
change note: Added a new rdfs:label in French.
  date: 2023-08-25
change note: examples added. Objective: to make RiC-O compliant with RiC-CM v0.2.
  date: 2020-11-01
example: approximate
example: circa
example: end unknown
scope note: Most often, this human readable expression of the accuracy of the date is used along with an ISO 8601 representation of the date. The qualifier can also be expressed as a machine-readable value, using the EDTF standard (thus, a specialization of the normalizedDateValue datatype property).
RiC-CM corresponding component: Corresponds to RiC-A13 (Date Qualifier attribute)

death date
type: DatatypeProperty
sub property of: end date
domain: Person
range: Literal
comment: Date at which a Person died.
label: date de décès @fr
label: fecha de muerte @es
change note: Added a new rdfs:label in Spanish.
  date: 2023-11-02
change note: Added a new rdfs:label in French.
  date: 2023-08-25
scope note: Provided for usability reasons. May be deprecated and removed later on. Use only if you don't use Date classes for handling dates.
RiC-CM corresponding component: Datatype property specialized implementation of RiC-E18 (Date entity)

derivation date
type: DatatypeProperty
sub property of: date
domain: Instantiation
range: Literal
comment: Date at which an Instantiation was or will be derived from another Instantiation.
label: date de dérivation @fr
label: fecha de derivación @es
change note: Added in RiC-O 1.1.
  date: 2025-03-01
scope note: Provided for usability reasons. May be deprecated and removed later on. Use only if you don't use Date classes for handling dates.
RiC-CM corresponding component: Datatype property specialized implementation of RiC-E18 (Date entity)

destruction date
type: DatatypeProperty
sub property of: end date
domain: Class
  union of: Instantiation
  union of: Record Resource
range: Literal
comment: Date at which a Record Resource or Instantiation was or will be destructed.
label: date de destruction @fr
label: fecha de destrucción @es
change note: Changed domain and definition (added "or will be").
  date: 2025-02-19
change note: Added a new rdfs:label in Spanish.
  date: 2023-11-12
change note: Renamed deletion into destruction.
  date: 2023-10-12
change note: Added a new rdfs:label in French.
  date: 2023-08-25
scope note: Provided for usability reasons. May be deprecated and removed later on. Use only if you don't use Date classes for handling dates.
RiC-CM corresponding component: Datatype property specialized implementation of RiC-E18 (Date entity)

end date
type: DatatypeProperty
sub property of: date
domain: Thing
range: Literal
comment: Date at which something ended.
label: date de fin @fr
label: fecha final @es
change note: Added a new rdfs:label in Spanish.
  date: 2023-11-02
change note: Added a new rdfs:label in French.
  date: 2023-08-25
scope note: Provided for usability reasons. May be deprecated and removed later on. Use only if you don't use Date classes for handling dates.
RiC-CM corresponding component: Datatype property specialized implementation of RiC-E18 (Date entity)

expressed date
type: DatatypeProperty
sub property of: name
sub property of: textual value
domain: Date
range: Literal
comment: Natural language expression of a date. This property is a specialization of the name property. In order that the precise meaning of the date can be understood, information such as the calendar used or other specific context should be included.
label: date en langage naturel @fr
label: fecha expresada @es
change note: Aligned with RiC-CM 1.0: updated the description (rdfs:comment), examples (skos:example).
  date: 2023-11-11
change note: Added a new rdfs:label in Spanish.
  date: 2023-11-02
change note: Updated the rdfs:comment and skos:examples in order to make this property fully compliant with RiC-CM 1.0. Made it a subproperty of rico:name.
  date: 2023-10-10
change note: Added a new rdfs:label in French.
  date: 2023-08-25
change note: examples added. Objective: to make RiC-O compliant with RiC-CM v0.2.
  date: 2020-11-01
example: 15 thermidor an IV (calendrier révolutionnaire français) @fr
example: 1550-1553, 1555 (date range)
example: 1925-1966 (date range)
example: 8 avril 1258 (a. st., style de Pâques) @fr
example: All of the years 1550, 1551, 1553, 1555
example: Die jovis ultima mensis martii anno domini millesimo quingentesimo quadragesimo ante Pascha @la
example: October 24, 1999 (month day, year)
example: One of the years 1550, 1551, 1553, 1555
example: The Middle Ages
example: The second semester of 1951 to 1952 (academic reference system)
example: XVIIe siècle @fr
RiC-CM corresponding component: Corresponds to RiC-A19 (Expressed Date attribute)

general description
type: DatatypeProperty
domain: Thing
range: Literal
comment: General information about an entity. General description may be used to describe any entity. There are different appropriate uses for general description. First, while it is recommended that more specific properties be used in describing an entity, it may be desirable, for economic or other reasons, to describe two or more specific properties together. Second, general description may be used to describe one or more characteristics that are not otherwise accommodated in RiC-O. Third, it may be used to provide a succinct summary or abstract description in addition to more detailed specific description.
label: descripción general @es
label: description générale @fr
change note: Aligned with RiC-CM 1.0: updated the IRI, mapping to RiC-CM (rico:RiCCMCorrespondingComponent), labels, description (rdfs:comment), examples (skos:example).
  date: 2023-11-11
change note: Added a new rdfs:label in Spanish.
  date: 2023-11-02
change note: Added a new rdfs:label in French.
  date: 2023-08-25
example: Le massif du Mont-Blanc est un massif des Alpes partagé entre la France, l'Italie et la Suisse. Il abrite le mont Blanc, plus haut sommet d'Europe occidentale qui culmine à 4 809 mètres (altitude relevée en 2015). Il est traversé par le tunnel du Mont-Blanc, entre Chamonix dans la vallée de l'Arve et Courmayeur dans la vallée d'Aoste. @fr
example: The Senate is the academic governing body of the University of Strathclyde and is responsible for all academic matters including academic standards and quality. Meetings of the Senate are chaired by the Principal and the membership is drawn entirely from within the University, comprising academic and research staff. (about a corporate body, University of Strathclyde Senate)
example: This activity involves regulating the nursing profession by conducting examinations and on-going education for nurses, maintaining rolls of those qualified as enrolled or registered nurses, midwives, psychiatric, and other specialised nurses. It also covers hearing disciplinary charges against nurses (and where necessary, removing them temporarily or permanently from the registers), as well as promoting the nursing profession. (about an activity, Nursing Profession Regulation)
example: Thomas Blaikie (1750-1838) est un botaniste et jardinier écossais. Il a dessiné notamment les jardins de Malmaison et Bagatelle. @fr
RiC-CM corresponding component: Corresponds to RiC-A43 (General Description attribute)

geodesic system
type: DatatypeProperty
sub property of: reference system
domain: Coordinates
range: Literal
comment: Reference system used for geographical coordinates.
label: sistema geodésico @es
label: système géodésique @fr
change note: Added a new rdfs:label in Spanish.
  date: 2023-11-02
change note: Added a new rdfs:label in French.
  date: 2023-08-25

geographical coordinates
type: DatatypeProperty
domain: Place
range: Literal
comment: Longitudinal and latitudinal information about a Place.
label: coordenadas geográficas @es
label: coordonnées géographiques @fr
change note: Aligned with RiC-CM 1.0: updated the description (rdfs:comment), examples (skos:example).
  date: 2023-11-11
change note: Added a new rdfs:label in Spanish.
  date: 2023-11-02
change note: Added a new rdfs:label in French.
  date: 2023-08-25
change note: Added a new rdfs:label in French.
  date: 2023-08-25
change note: Text definition and scope note updated. Examples added. Objective: to make RiC-O compliant with RiC-CM v0.2.
  date: 2020-11-01
example: Latitude 35.89421911, Longitude 139.94637467 (ISO 6709/F)
example: Latitude 50°40′46,461″N, Longitude 95°48′26,533″W, Height 123,45m (ISO 6709/D)
scope note: Provided for usability reasons. May be deprecated and removed later on. Use only if you don't use PhysicalLocation and Coordinates classes with Place. Coordinates may be based on ISO 6709 Standard representation of geographic point location by coordinates.
RiC-CM corresponding component: Corresponds to RiC-A11 (Coordinates attribute)

height
type: DatatypeProperty
sub property of: measure
domain: Thing
range: Literal
comment: Vertical dimension of an entity.
label: altura @es
label: hauteur @fr
change note: Added a new rdfs:label in Spanish.
  date: 2023-11-02
change note: Added a new rdfs:label in French.
  date: 2023-08-25

history
type: DatatypeProperty
domain: Class
  union of: Agent
  union of: Event
  union of: Instantiation
  union of: Place
  union of: Record Resource
  union of: Rule
range: Literal
comment: Summary of the development of an entity throughout its existence.
label: histoire @fr
label: historia @es
change note: Aligned with RiC-CM 1.0: updated the description (rdfs:comment), skos:scopeNote, domain, examples (skos:example).
  date: 2023-11-11
change note: Added a new rdfs:label in Spanish.
  date: 2023-11-02
change note: Added a new rdfs:label in French.
  date: 2023-08-25
change note: Domains updated. Examples added. Objective: to make RiC-O compliant with RiC-CM v0.2.
  date: 2020-11-01
example: El primer sorteo de lotería se celebró el 13 de mayo de 1771, siendo desarrollado por la Real Lotería General de Nueva España… (sobre una actividad) @es
example: Nacido en Barbastro en 1892, donde realizó sus primeros estudios con los escolapios. Licenciado en Derecho por la Universidad de Zaragoza, aprobó las oposiciones al cuerpo nacional de notarios… (sobre una persona) @es
example: The manuscripts are part of the collections of Robert Harley (d 1724) and Edward Harley (d 1741), 1st and 2nd Earls of Oxford, that were brought by Parliament and transferred to the British Museum in 1753. Those materials were then separated into this collection and those for Harley Charters and Harley Rolls and became part of the collections of the British Library in 1972. (about a Record Set)
scope note: For a record set, may be used to summarize the history of the Record Set itself, or additionally to summarize the history of some or all members of the Record Set. Should not be confused with the scope and content property.
RiC-CM corresponding component: Corresponds to RiC-A21 (History attribute)

identifier
type: DatatypeProperty
domain: Thing
range: Literal
comment: A word, number, letter, symbol, or any combination of these used to uniquely identify or reference an individual instance of an entity within a specific information domain. Can include Global Persistent Identifiers (globally unique and persistently resolvable identifier for the entity) and/or Local Identifiers. Both the domain within which the identifier is unique, and the rules used in forming the identifier value should be provided with the identifier value.
label: identifiant @fr
label: identificador @es
change note: Aligned with RiC-CM 1.0: updated the description (rdfs:comment), skos:scopeNote, examples (skos:example).
  date: 2023-11-11
change note: Added a new rdfs:label in Spanish.
  date: 2023-11-02
change note: Added a new rdfs:label in French.
  date: 2023-08-25
change note: Text definition and scope note updated. Examples added. Objective: to make RiC-O compliant with RiC-CM v0.2.
  date: 2020-11-01
example: B-000091 (example of a unique identifier for an instantiation assigned by a repository)
example: BUD-01-F002 (example of a classification number from a corporate file plan)
example: F 1204 (example of a local identifier for a record set assigned by a repository)
example: NAS1/A/1.1 (example of a local identifier for a record)
example: http://isni.org/0000000073572182 (example of a persistent International Standard Name Identifier for a person)
example: http://n2t.net/ark:/99166/w6tz44ht (example of an Archival Resource Key for a person)
example: http://n2t.net/ark:/99166/w6v1266v (example of an Archival Resource Key for a record)
scope note: Use only if you don't use Identifier class for handling identifiers. Within a given domain (a closed system), identifiers are used to uniquely reference instances of an entity. Identifiers are instruments of control that facilitate management of the entities within the domain. The formulation of identifiers commonly is based on rules. In addition to an identifier needing to be unique within a domain, it is also highly desirable that it be persistent, that is, that the identifier uniquely identifies the entity over time. A variety of organizations provide rules for the formation of identifiers, and services designed to facilitate the persistence of identifiers. Such identifiers are commonly referred to as Persistent Identifiers (or PIDs). PIDs conform to RFC 3986, but impose additional rules. Common examples are Archival Resource Keys (ARKs) and Digital Object Identifiers (DOIs). Within the global environment of the Internet, there are special rules for the formation of identifiers to ensure that they are unique within the domain of the Internet. Such identifiers must conform to the Internet Engineering Task Force (IETF) Uniform Resource Identifier rules (RFC 3986).
RiC-CM corresponding component: Corresponds to RiC-A22 (Identifier attribute)

Instantiation extent
type: DatatypeProperty
sub property of: physical or logical extent
domain: Instantiation
range: Literal
comment: Countable characteristics of an Instantiation expressed as a quantity.
label: mesure de l’instanciation @fr
label: soporte de instanciación @es
change note: Aligned with RiC-CM 1.0: updated the description (rdfs:comment), skos:scopeNote, examples (skos:example).
  date: 2023-11-11
change note: Added a new rdfs:label in Spanish.
  date: 2023-11-02
change note: Added a new rdfs:label in French.
  date: 2023-08-25
change note: Scope note updated. Examples added. Objective: to make RiC-O compliant with RiC-CM v0.2.
  date: 2020-11-01
example: 234 linear metres
example: Size of PDF file: 1.5 MB
example: The register has 345 written folios
scope note: Instantiation extent should not be confused with record resource extent or carrier extent. For a given Record Resource, the instantiation extent may vary, based on format, density of information on the carrier, etc. For example, a CD with a storage capacity of 700 MB (carrier extent) might hold a record of 1500 words (record resource extent) represented in two versions, one a Word document with an instantiation extent of 3 KB and the other a PDF file with an instantiation extent of 5 KB.
RiC-CM corresponding component: Corresponds to RiC-A23 (Instantiation Extent attribute)

Instantiation structure
type: DatatypeProperty
sub property of: structure
domain: Instantiation
range: Literal
comment: Information about the physical arrangement and composition of an Instantiation.
label: estructura de la instanciación @es
label: structure de l’instanciation @fr
change note: Added a new rdfs:label in Spanish.
  date: 2023-11-02
change note: Added a new rdfs:label in French.
  date: 2023-08-25
change note: Text definition fixed. Objective: to make RiC-O compliant with RiC-CM v0.2.
  date: 2020-11-01
RiC-CM corresponding component: Specialization of RiC-A40 (Structure attribute)

integrity note
type: DatatypeProperty
sub property of: note
domain: Record Resource
range: Literal
comment: Information about the known intellectual completeness of a Record Resource.
label: nota de integridad @es
label: note sur l'intégrité @fr
change note: Made this property a subproperty of the new rico:note datatype property.
  date: 2025-01-17
change note: Aligned with RiC-CM 1.0: updated the IRI, mapping to RiC-CM (rico:RiCCMCorrespondingComponent), labels, description (rdfs:comment), skos:scopeNote, domain, examples (skos:example).
  date: 2023-11-11
change note: Added a new rdfs:label in Spanish.
  date: 2023-11-02
change note: Added a new rdfs:label in French.
  date: 2023-08-25
change note: Scope note and examples added. Objective: to make RiC-O compliant with RiC-CM v0.2.
  date: 2020-11-01
example: A web page (HTML, 15 images, 2 CSS, 1 javascript), with 5 images missing.
example: For record set: series of letters, one is missing so the integrity is compromised.
example: Line three of a hand-written letter was cut out and a replacement text was inserted by an unknown person.
example: Part of the text is missing (because a corner on the instantiation was cut out, which is a physical characteristic). See also the examples of physicalCharacteristics.
scope note: May be used in a Record Set description when its value is shared by some or all members of the Record Set. The information about integrity may be generated manually or automatically. Not to be confused with the physical completeness of the instantiation, which is covered by the physical characteristics note attribute. The integrity of a Record Resource and the physical characteristics note of an Instantiation may be complementary. This attribute also covers any additions to or removal of original information.
RiC-CM corresponding component: Corresponds to RiC-A24 (Integrity Note attribute)

last modification date
type: DatatypeProperty
sub property of: modification date
domain: Thing
range: Literal
comment: Date at which an entity was last updated.
label: date de dernière modification @fr
label: fecha de última modificación @es
change note: Added a new rdfs:label in Spanish.
  date: 2023-11-02
change note: Added a new rdfs:label in French.
  date: 2023-08-25
scope note: Provided for usability reasons. May be deprecated and removed later on. Use only if you don't use Date classes for handling dates.
RiC-CM corresponding component: Datatype property specialized implementation of RiC-E18 (Date entity)

latitude
type: DatatypeProperty
sub property of: measure
domain: Coordinates
range: Literal
comment: Distance in degrees north or south of the equator.
label: latitud @es
change note: Added a new rdfs:label in Spanish.
  date: 2023-11-02
change note: Added a new rdfs:label in French.
  date: 2023-08-25
scope note: Property of the Coordinates class. If you don't use this class, use geographicalCoordinates property, a property of Place class.

length
type: DatatypeProperty
sub property of: measure
domain: Thing
range: Literal
comment: Length of an entity.
label: longitud @es
label: longueur @fr
change note: Added a new rdfs:label in Spanish.
  date: 2023-11-12
change note: Added for enabling to describe entities that have such a dimension.
  date: 2023-08-28
scope note: May be used, among other cases, for storing the length of some places like streets.

location
type: DatatypeProperty
domain: Place
range: Literal
comment: A delimitation of the physical territory of a Place. Used to describe basic human-readable text such as an address, a cadastral reference, or less precise information found in a Record.
label: localisation @fr
label: localización @es
change note: Aligned with RiC-CM 1.0: updated the description (rdfs:comment), skos:scopeNote, examples (skos:example).
  date: 2023-11-11
change note: Added a new rdfs:label in Spanish.
  date: 2023-11-02
change note: Added a new rdfs:label in French.
  date: 2023-08-25
change note: Text definition and scope note updated. Examples added. Objective: to make RiC-O compliant with RiC-CM v0.2.
  date: 2020-11-01
example: 25 rue Saint-Denis à Paris @fr
example: Montreal (city in Canada)
scope note: Use only if you don't use PhysicalLocation class with Place. Use the geographicalCoordinates property, or the Coordinates class, to record the geographical coordinates of the Place. Use the spatial relations (particularly 'has or had location') to capture a relation between two places.
RiC-CM corresponding component: Corresponds to RiC-A27 (Location attribute)

longitude
type: DatatypeProperty
sub property of: measure
domain: Coordinates
range: Literal
comment: Distance in degrees east or west of a prime meridian.
label: longitud @es
change note: Added a new rdfs:label in Spanish.
  date: 2023-11-02
change note: Added a new rdfs:label in French.
  date: 2023-08-25
scope note: Property of the Coordinates class. If you don't use this class, use geographicalCoordinates property, a property of Place class.

measure
type: DatatypeProperty
domain: Thing
range: Literal
comment: The extent, quantity, amount, or degree of an entity, as determined by measurement or calculation.
label: medida @es
label: mesure @fr
change note: Added a new rdfs:label in Spanish.
  date: 2023-11-02
change note: Added a new rdfs:label in French.
  date: 2023-08-25

migration date
type: DatatypeProperty
sub property of: derivation date
domain: Instantiation
range: Literal
comment: Date at which an Instantiation was or will be migrated.
label: date de migration @fr
label: fecha de migración @es
change note: Removed 'Record Resource' from the definition and made the property a subproperty of the new 'derivationDate' property.
  date: 2025-03-01
change note: Added in RiC-O 1.1.
  date: 2025-02-19
scope note: Provided for usability reasons. May be deprecated and removed later on. Use only if you don't use Date classes for handling dates.
RiC-CM corresponding component: Datatype property specialized implementation of RiC-E18 (Date entity)

modification date
type: DatatypeProperty
sub property of: date
domain: Thing
range: Literal
comment: Date of the modification of an entity.
label: date de modification @fr
label: fecha de modificación @es
change note: Added a new rdfs:label in Spanish.
  date: 2023-11-02
change note: Added a new rdfs:label in French.
  date: 2023-08-25
scope note: Provided for usability reasons. May be deprecated and removed later on. Use only if you don't use Date classes for handling dates.
RiC-CM corresponding component: Datatype property specialized implementation of RiC-E18 (Date entity)

most members with accumulation date
type: DatatypeProperty
sub property of: some members with accumulation date
domain: Record Set
range: Literal
comment: Date at which most of the present or past members of a Record Set were or will be accumulated.
label: des membres dont la plupart ont pour date d’accumulation @fr
label: la mayoría de sus miembros como fecha de acumulación @es
change note: Changed definition (added "or will be").
  date: 2025-02-19
change note: Added in RiC-O 1.1.
  date: 2024-12-19
scope note: Datatype property analogue of 'hasOrHadMostMembersWithAccumulationDate', which is provided for usability reasons. May be deprecated and removed later on. Use only if you don’t use Date classes for handling dates.

most members with creation date
type: DatatypeProperty
sub property of: some members with creation date
domain: Record Set
range: Literal
comment: Date at which most of the present or past members of a Record Set were or will be created.
label: des membres dont la plupart ont pour date de création @fr
label: la mayoría de sus miembros como fecha de creación @es
change note: Changed definition (added "or will be").
  date: 2025-02-19
change note: Added in RiC-O 1.1.
  date: 2024-12-19
scope note: Datatype property analogue of 'hasOrHadMostMembersWithCreationDate', which is provided for usability reasons. May be deprecated and removed later on. Use only if you don’t use Date classes for handling dates.
RiC-CM corresponding component: RiC-R083i ('has or had most members with creation date' relation).

name
type: DatatypeProperty
domain: Thing
range: Literal
comment: A label, title or term designating an entity in order to make it distinguishable from other similar entities.
label: nom @fr
label: nombre @es
change note: Aligned with RiC-CM 1.0: updated the description (rdfs:comment), skos:scopeNote, examples (skos:example).
  date: 2023-11-11
change note: Added a new rdfs:label in Spanish.
  date: 2023-11-02
change note: Added a new rdfs:label in French.
  date: 2023-08-25
change note: Text definition updated. Examples added. Objective: to make RiC-O compliant with RiC-CM v0.2.
  date: 2020-11-01
example: D-Day (about a Date or Event)
example: Digital copy of the Pomarius archival inventory from 1575 (about an Instantiation)
example: Fundraising, University of Glasgow (about an Activity)
example: Halloween 2016 (about a Date)
example: Nelson Mandela (about a Person)
example: Papers of the Earls of Liverpool (about a Record Set)
example: Paris (about a Place)
example: Prime Minister (about a Position)
example: Providing hearing services (about an Activity)
example: Sketch Map of the Qatar Peninsula (about a Record)
example: The Letter of Neacsu from Campulung to the Mayor of Brasov (about a Record)
scope note: Use only if you don't use Name class for handling names. Provides brief information about the content or other individual characteristics of the entity being described, necessary to distinguish it from other perhaps similar entities.
RiC-CM corresponding component: Corrresponds to RiC-A28 (Name attribute)

normalized date value
type: DatatypeProperty
sub property of: normalized value
domain: Date
range: Literal
comment: Machine readable representation of the date based on a public technical standard.
label: valeur normalisée de la date @fr
label: valor normalizado de fecha @es
change note: Fixed a typo in two of the EDTF examples.
  date: 2024-09-02
change note: Aligned with RiC-CM 1.0: updated the examples (skos:example).
  date: 2023-11-11
change note: Added a new rdfs:label in Spanish.
  date: 2023-11-02
change note: Updated the rdfs:comment and examples, and added a scopeNote, in order to make this property fully compliant with RiC-CM 1.0.
  date: 2023-10-10
change note: Added a new rdfs:label in French.
  date: 2023-08-25
change note: Examples added. Objective: to make RiC-O compliant with RiC-CM v0.2.
  date: 2020-11-01
example: 1550,1551,1553,1555 (a date set in EDTF, meaning one of the years 1550, 1551, 1553, 1555)
example: 1948-03 (an ISO 8601 form of a single date)
example: 1948-03-08 (an ISO 8601 form of a single date)
example: 1948-03~ (a single date in ETDF, meaning March 1948 approximately)
example: 1948/ (a date range in EDTF, starting in 1948, end unknown)
example: 1948/.. (an open date range in EDTF, starting in 1948)
example: 2012-02-14/2015-03-08 (an ISO 8601 form of a date range)
example: 2012/2015-03 (an ISO 8601 form of a date range)
example: {1550,1551,1553,1555} (a date set in EDTF, meaning all of the years 1550, 1551, 1553, 1555)
example: {1805,1815..1820} (a date set in EDTF, meaning all of the years 1805, 1815, 1816, 1817, 1818, 1819, 1820)
scope note: Used to represent the date in a standardized format that can be processed programmatically. The main standard used today is ISO 8601, which is based on the Gregorian calendar. See also the Extended Date Time Format (EDTF), which is an extension of ISO 8601, and enables, among other features, to represent a date set, and to indicate the date is approximate.
RiC-CM corresponding component: Corresponds to RiC-A29 (Normalized Date attribute)

normalized value
type: DatatypeProperty
sub property of: textual value
domain: Class
  union of: Appellation
  union of: Date
range: Literal
comment: Value representation based on a standard, preferably machine-readable.
label: valeur normalisée @fr
label: valor normalizado @es
change note: Added a new rdfs:label in Spanish.
  date: 2023-11-02
change note: Added a new rdfs:label in French.
  date: 2023-08-25

note
type: DatatypeProperty
domain: Thing
range: Literal
comment: A short textual statement, that gives a little information on a specific feature of a Thing.
label: nota @es
change note: Added in RiC-0 1.1, as a superproperty of any possible kind of note.
  date: 2025-01-17
scope note: Not to be confused with the rico:generalDescription datatype property, which is used to provide a textual description of a Thing. Use the subproperties of rico:note when they are appropriate.

physical characteristics note
type: DatatypeProperty
sub property of: note
domain: Instantiation
range: Literal
comment: Information about the physical features, completeness, or conservation status of an Instantiation. Includes information about the physical nature and condition such as conservation status or the deterioration of an Instantiation (for example its carrier) affecting the ability to recover information.
label: nota sobre las características físicas @es
label: note sur les caractéristiques physiques @fr
change note: Made this property a subproperty of the new rico:note datatype property.
  date: 2025-01-17
change note: Aligned with RiC-CM 1.0: updated the IRI, mapping to RiC-CM (rico:RiCCMCorrespondingComponent), labels, description (rdfs:comment), skos:scopeNote, examples (skos:example).
  date: 2023-11-11
change note: Added a new rdfs:label in Spanish.
  date: 2023-11-02
change note: Added a new rdfs:label in French.
  date: 2023-08-25
change note: Text definition updated. Examples added. Objective: to make RiC-O compliant with RiC-CM v0.2.
  date: 2020-11-01
example: A web page (HTML, 15 images, 2 CSS, 1 JavaScript), with 1 CSS missing.
example: British Library binding
example: Digital file format: JPEG-2000
example: For carrier: hard drives on which the author wrote physically (using a pen).
example: Letter physical characteristics: corner without text missing – the carrier is damaged, but no information of the content is missing
example: The charter is missing the seal.
example: Watermarked
example: carrier heavily foxed
example: some loss of text due to rodent damage
scope note: Not to be confused with the intellectual completeness of a Record Resource and its sub-entities, which is covered by the Integrity attribute. May include digital file fixity.
RiC-CM corresponding component: Corresponds to RiC-A31 (Physical Characteristics Note attribute)

physical or logical extent
type: DatatypeProperty
domain: Class
  union of: Instantiation
  union of: Record Resource
range: Literal
comment: Countable characteristics of the content of an entity expressed as a quantity.
label: importance physique ou logique @fr
label: soporte físico o lógico @es
change note: Added a new rdfs:label in Spanish.
  date: 2023-11-02
change note: Added a new rdfs:label in French.
  date: 2023-08-25
scope note: Provided for usability reasons. Use only if you cannot use the subproperties (particularly if the same free text is being used in your current metadata for describing the record resource, carrier and instantiation extent).

production technique
type: DatatypeProperty
domain: Instantiation
range: Literal
comment: The method used in the representation of information on an Instantiation.
label: technique de production @fr
label: técnica de produccióon @es
change note: Aligned with RiC-CM 1.0: updated the description (rdfs:comment).
  date: 2023-11-11
change note: Added a new rdfs:label in Spanish.
  date: 2023-11-02
change note: Added a new rdfs:label in French.
  date: 2023-08-25
change note: Examples added. Objective: to make RiC-O compliant with RiC-CM v0.2.
  date: 2020-11-01
example: engraving
example: handwriting
example: magnetic recording
example: optical recording
scope note: Use only if you have free text or don't have a controlled vocabulary for production techniques (in this case, use the ProductionTechniqueType class)
RiC-CM corresponding component: Corresponds to RiC-A33 (Production Technique attribute)

publication date
type: DatatypeProperty
sub property of: date
domain: Record Resource
range: Literal
comment: Date of the publication, in the past or in the future, of a Record Resource.
label: date de publication @fr
label: fecha de publicación @es
change note: Changed definition (added "in the past or in the future").
  date: 2025-02-19
change note: Added a new rdfs:label in Spanish.
  date: 2023-11-02
change note: Added a new rdfs:label in French.
  date: 2023-08-25
scope note: Provided for usability reasons. May be deprecated and removed later on. Use only if you don't use Date classes for handling dates.
RiC-CM corresponding component: Datatype property specialized implementation of RiC-E18 (Date entity)

quality of representation note
type: DatatypeProperty
sub property of: physical characteristics note
domain: Instantiation
range: Literal
comment: Characteristics of an Instantiation that affect the ability to recover the intellectual content. Such characteristics may be related to the methods used in creating the Instantiation or introduced subsequent to the creation through accident.
label: nota sobre la calidad de representación @es
label: note sur la qualité de la représentation @fr
change note: Aligned with RiC-CM 1.0: updated the IRI, mapping to RiC-CM (rico:RiCCMCorrespondingComponent), labels, description (rdfs:comment), skos:scopeNote, rdfs:subpropertyOf.
  date: 2023-11-11
change note: Added a new rdfs:label in Spanish.
  date: 2023-11-02
change note: Added a new rdfs:label in French.
  date: 2023-08-25
change note: Text definition updated. Examples added. Objective: to make RiC-O compliant with RiC-CM v0.2.
  date: 2020-11-01
example: Black and white digitization may have led to loss of some information.
example: some loss of information due to poor quality of image capture
example: some loss of text due to rodent damage
scope note: Quality of representation note is a specialization of physical characteristics note. Quality of representation note should be used in conjunction with physical characteristics note when the physical characteristics impact the ability to recover the intellectual content.
RiC-CM corresponding component: Corresponds to RiC-A34 (Quality of Representation Note attribute)

quantity
type: DatatypeProperty
sub property of: textual value
domain: Extent
range: decimal
comment: Machine-readable quantity.
label: cantidad @es
label: quantité @fr
change note: Added a new rdfs:label in Spanish.
  date: 2023-11-02
change note: Added an xml:lang attribute to the rdfs:comment.
  date: 2023-08-28
change note: Added a new rdfs:label in French.
  date: 2023-08-25
change note: Added a scope note.
  date: 2020-11-21
change note: Datatype property created along with unitOfMeasurement, Extent and UnitOfMeasurement classes, in order to provide methods for handling extent accurately.
  date: 2020-10-28
scope note: Use if you use the Extent class and its properties for handling an accurate description of the extent of a resource.

rank in hierarchy
type: DatatypeProperty
sub property of: textual value
domain: Class
  union of: Record Resource
  union of: Proxy
range: int
comment: The rank of a Record Resource, or of a Proxy that stands for it, in a hierarchy.
label: rang dans la hiérarchie @fr
label: rango en la jerarquía @es
change note: Introduced in RiC-O 1.1.
  date: 2025-03-04
scope note: The object properties rico:directlyIncludes and rico:hasDirectConstituent, or variants of these which are sub-properties of rico:hasOrHadPart, should always be used to express hierarchies in RiC-O. The rico:rankInHierarchy datatype property should only be used in addition (never independently), for convenience (for example to help display or query a graph). But it should be ensured that it reflects and is compatible with (e.g. computed using) the hierarchical object properties in the intended context (e.g. a hierarchy of Record Parts in a given Record). Thus, if, for example, Record Part A rico:hasDirectConstituent Record Part B, then the rico:rankInHierarchy of Record Part B must be strictly greater than rico:rankInHierarchy of Record Part A, and no other Record Part in that context should have rico:rankInHierarchy between that of Record Part A and Record Part B. For a given Record Resource, rico:rankInHierarchy should never be used more than once. If a Record Resource belongs to more than one hierarchy, a rico:Proxy of the Record Resource should be introduced, and rico:rankInHierarchy have source such a proxy, in all cases except (possibly) the first.

rank in sequence
type: DatatypeProperty
sub property of: textual value
domain: Class
  union of: Record Resource
  union of: Proxy
range: int
comment: The rank of a Record Resource, or of a Proxy that stands for it, in a sequence.
label: rang dans la séquence @fr
label: rango en la secuencia @es
change note: Introduced in RiC-O 1.1.
  date: 2025-03-04
scope note: The object property rico:precedesOrPreceded or one of its sub-properties should always be used to express sequences in RiC-O. The rico:rankInSequence datatype property should only be used in addition (never independently), for convenience (for example to help display or query a graph). But it should be ensured that it reflects and is compatible with (e.g. computed using) the sequential object properties in the intended context (e.g. the Records in a given Record Set). Thus, if, for example, Record Resource A rico:precedesOrPreceded Record Resource B, then the rico:rankInSequence of Record Resource B must be strictly greater than rico:rankInSequence of Record Resource A, and no other Record Resource in that context should have rico:rankInSequence between that of Record Resource A and Record Resource B. For a given Record Resource, rico:rankInSequence should never be used more than once. If a Record Resource belongs to more than one sequence, a rico:Proxy of the Record Resource should be introduced, and rico:rankInSequence have source such a proxy, in all cases except (possibly) the first.

Record Resource Extent
type: DatatypeProperty
sub property of: physical or logical extent
domain: Record Resource
range: Literal
comment: The quantity of information content, as human experienced, contained in a Record Resource. The method and precision of expressing the quantity of information represented in a Record Resource will vary according to the kind of Record Resource being described, processing economy constraints, etc. For record sets, quantity may be expressed as number of records, or, for analogue records in particular, by the physical storage dimensions of the members of the Record Set. For individual records or record parts, quantity may be expressed in more precise terms.
label: mesure de la ressource archivistique @fr
label: soporte de recurso documental @es
change note: Fix capitalisation in English label.
  date: 2024-03-15
change note: Aligned with RiC-CM 1.0: updated the description (rdfs:comment), skos:scopeNote, examples (skos:example).
  date: 2023-11-11
change note: Added a new rdfs:label in Spanish.
  date: 2023-11-02
change note: Added a new rdfs:label in French.
  date: 2023-08-25
change note: Updated the scope note, as a RecordResourceExtent class has been created.
  date: 2020-11-21
change note: Text definition and scope note updated. Examples added. Objective: to make RiC-O compliant with RiC-CM v0.2.
  date: 2020-11-01
example: 1,500 words
example: 2 films
example: 2.065.735 characters
example: 3 minutes and 24 seconds
example: 6 maps
example: 6 photographs
scope note: Use if you don't use RecordResourceExtent class and its properties for handling such information. Record resource extent should not be confused with instantiation extent or carrier extent. The number, size or duration of the information content unit(s) remains the same even if the information is instantiated in various carriers. For example, a CD with a storage capacity of 700 MB (carrier extent) might hold a record of 1,500 words (record resource extent) represented in two versions, one a Word document with an instantiation extent of 3 KB and the other a PDF file with an instantiation extent of 5 KB.
RiC-CM corresponding component: Corresponds to RiC-A35 (Record Resource Extent attribute)

Record Resource source of information
type: DatatypeProperty
domain: Record Resource
range: Literal
comment: Information about some source on which the content of a Record Resource is based.
label: fuente de información de recurso documental @es
label: source d’information de la ressource archivistique @fr
change note: Datatype property added in RiC-O 1.1. It replaces, as concerns Record Resources, the former 'source' datatype property, that was available in RiC-0 0.1 and RiC-O 0.2, and was removed in RiC-O 1.0.
  date: 2025-01-16
example: Dardy-Cretin (Michèle), Histoire administrative du ministère de la culture et de la communication (1959-2012). Paris: Collection du Comité d’histoire du ministère de la culture et de la communication, 2012. @fr
scope note: Can be used, for example, for Records having documentary form type Authority Record or Finding Aid. Use only if you don't use the 'recordResourceHasSourceOfInformation' object property.

Record Resource structure
type: DatatypeProperty
sub property of: structure
domain: Record Resource
range: Literal
comment: Information about the intellectual arrangement and composition of a Record Resource. For Record and Record Part, it encompasses information about the intellectual composition of the record, the presence of record parts and their functions. For Record Set, it encompasses information about the methodology or criteria used for arranging the Record Set members or Record members within the containing Record Set
label: estructura de recurso documental @es
label: structure de la ressource archivistique @fr
change note: Added a new rdfs:label in Spanish.
  date: 2023-11-02
change note: Added a new rdfs:label in French.
  date: 2023-08-25
change note: Text definition updated. Examples added. Objective: to make RiC-O compliant with RiC-CM v0.2.
  date: 2020-11-01
example: Inside each file, the records are arranged chronologically.
example: The database has 3 related tables: names, addresses, and passport numbers.
example: The record has 2 appendixes, comprising a full account of the income from car taxes and real estate taxes.
example: The series have the files arranged according to the alphabetical order of the places concerned.
RiC-CM corresponding component: Specialization of RiC-A40 (Structure attribute)

reference system
type: DatatypeProperty
domain: Thing
range: Literal
comment: Framework or standard used to represent an information.
label: sistema de referencia @es
label: système de référence @fr
change note: Added a new rdfs:label in Spanish.
  date: 2023-11-02
change note: Added a new rdfs:label in French.
  date: 2023-08-25

relation certainty
type: DatatypeProperty
domain: Relation
range: Literal
comment: Qualifies the level of certitude of the accuracy of a Relation.
label: certeza de la relación @es
label: degré de certitude de la relation @fr
change note: Renamed the datatype property (was 'certainty') and reduced its domain to Relation (the dmain was the union of Event and Relation). Consequently updated the labels.
  date: 2023-12-27
change note: Added a new rdfs:label in Spanish.
  date: 2023-11-02
change note: Reintroduced this datatype property, with the definition assigned to it in RiC-CM 1.0, apart from its domain that also includes Event.
  date: 2023-10-14
example: certain
example: uncertain
example: unknown
RiC-CM corresponding component: Corresponds to RiC-RA01 (Certainty of Relation attribute)

relation source
type: DatatypeProperty
domain: Relation
range: Literal
comment: A source of information used for identifying and describing a Relation.
label: fuente de la relación @es
label: source de la relation @fr
change note:
  date: 2023-12-27
  value: Renamed the datatype property (was 'source') and reduced its domain to Relation (the domain was the union of Record Resource and Relation). Consequently updated the rdfs:comment, labels and scope note. Added a rico:RiCCMCorrespondingComponent annotation.
change note: Added a new rdfs:label in Spanish.
  date: 2023-11-02
change note: Added a new rdfs:label in French.
  date: 2023-08-25
scope note: Use only if you don't use the 'isEvidencedBy' object property.
RiC-CM corresponding component: Corresponds to RiC-RA05 (Source of Relation attribute).

relation state
type: DatatypeProperty
domain: Relation
range: Literal
comment: Used to qualify the state of a Relation (e. g. present, past, ongoing, unknown).
label: estado de la relación @es
label: statut de la relation @fr
change note: Added a new rdfs:label in Spanish.
  date: 2023-11-02
change note: Added a new rdfs:label in French.
  date: 2023-08-25

rule followed
type: DatatypeProperty
domain: Thing
range: Literal
comment: The rule or conditions that govern the existence or lifecycle of a Thing.
label: regla aplicada @es
label: règle suivie @fr
change note: Added a new rdfs:label in Spanish.
  date: 2023-11-02
change note: Added a new rdfs:label in French.
  date: 2023-08-25
scope note: Provided for usability reasons. May be deprecated and removed later on. Use only if you don't use the Rule class for handling rules.

scope and content
type: DatatypeProperty
sub property of: general description
domain: Record Resource
range: Literal
comment: Summary of the scope (such as time periods, geography) and content (such as subject matter, administrative processes) of a Record Resource. Provides a more complete summary of the informational content of the Record Resource highlighting the information conveyed in the Record Resource, why it was created, received, and/or maintained, and the agents connected to it. It may include description of relations with agents, activities, dates and places, or with other record resources.
label: alcance y contenido @es
label: portée et contenu @fr
change note: Aligned with RiC-CM 1.0: updated the description (rdfs:comment), skos:scopeNote, rdfs:subpropertyOf, examples (skos:example).
  date: 2023-11-11
change note: Added a new rdfs:label in Spanish.
  date: 2023-11-02
change note: Added a new rdfs:label in French.
  date: 2023-08-25
change note: Added a new rdfs:label in French.
  date: 2023-08-25
change note: Text definition updated. Examples added. Objective: to make RiC-O compliant with RiC-CM v0.2.
  date: 2020-11-01
example: Among the witnesses, the Duke of Normandy.
example: Includes a detailed list of the lands and villages given by the King to the Abbey.
example: Letter from Vlad the Impaler (Dracula) to the Council of Kronstadt asking them to send military support against the Ottomans, within the framework of their alliance treaty.
example: Se hace referencia a construcción del Gran Hotel, iniciada en 1899 bajo el nombre de Casa Celestino. Tras su interrupción en 1902, continuó la obra ya con su nombre actual. @es
example: The author explains why he does not agree with the decision made and adds that it cannot be applied.
scope note: Scope and content is a specialization of general description. For a Record Set, may be used to summarize the scope and content of the Record Set itself, or additionally to summarize the scope and content of some or all members of the Record Set. It is not to be confused with the history dataytpe property which focuses on the origination and subsequent changes to a Record Resource.
RiC-CM corresponding component: Corresponds to RiC-A38 (Scope and Content attribute)

sentiment or emotion expressed
type: DatatypeProperty
sub property of: scope and content
domain: Class
  union of: Documento
  union of: Record Part
range: Literal
comment: Specification of, or information about, the sentiment(s) or emotion(s) expressed by the content of a Record or a Record Part.
label: sentiment ou émotion exprimés @fr
label: sentimiento o emoción expresados @es
change note: Introduced in RiC-O 1.1.
  date: 2025-04-05
scope note: Can in particular be used for textual or visual Records or Record Parts.

some members with accumulation date
type: DatatypeProperty
sub property of: date
domain: Record Set
range: Literal
comment: Date at which some of the present or past members of a Record Set were or will be accumulated.
label: algunos de sus miembros como fecha de acumulación @es
label: des membres ayant pour date d’accumulation @fr
change note: Changed definition (added "or will be").
  date: 2025-02-19
change note: Added in RiC-O 1.1.
  date: 2024-12-19
scope note: Datatype property analogue of 'hasOrHadSomeMembersWithAccumulationDate', which is provided for usability reasons. May be deprecated and removed later on. Use only if you don’t use Date classes for handling dates.

some members with creation date
type: DatatypeProperty
sub property of: beginning date
domain: Record Set
range: Literal
comment: Date at which some of the present or past members of a Record Set were or will be created.
label: algunos de sus miembros como fecha de creación @es
label: des membres ayant pour date de création @fr
change note: Changed definition (added "or will be").
  date: 2025-02-19
change note: Added in RiC-O 1.1.
  date: 2024-12-19
scope note: Datatype property analogue of 'hasOrHadSomeMembersWithCreationDate', which is provided for usability reasons. May be deprecated and removed later on. Use only if you don’t use Date classes for handling dates.
RiC-CM corresponding component: RiC-R082i ('has or had some members with creation date' relation).

structure
type: DatatypeProperty
domain: Class
  union of: Instantiation
  union of: Record Resource
range: Literal
comment: Information about the intellectual arrangement and composition of a Record Resource or the physical arrangement and composition of an Instantiation. For Record and Record Part, it encompasses information about the intellectual composition of the record, the presence of record parts and their functions. For Record Set, it encompasses information about the methodology or criteria used for arranging the Record Set members or Record members within the containing Record Set. For Instantiation, it may comprise information about the composition of the physical elements of the instantiation
label: estructura @es
change note: Aligned with RiC-CM 1.0: updated the skos:scopeNote, examples (skos:example).
  date: 2023-11-11
change note: Added a new rdfs:label in Spanish.
  date: 2023-11-02
change note: Added a new rdfs:label in French.
  date: 2023-08-25
change note: Text definition updated. Objective: to make RiC-O compliant with RiC-CM v0.2.
  date: 2020-11-01
example: Inside each file, the records are arranged chronologically (about a record set)
example: The database has three related tables: names, addresses, and passport numbers (about a record)
example: The record has two appendices, comprising a full account of the income from car taxes and real estate taxes
example: The series have the files arranged according to the alphabetical order of the places concerned
scope note: Use only if you cannot use the subproperties (particularly if the same free text is being used in your current metadata for describing the record resource and the instantiation structure). For a Record Set, may be used to summarize the structure of the Record Set itself, or additionally to summarize the structure of some or all members of the Record Set. Should not be confused with the classification datatype property, which provides information about the category which the Record Set belongs to within a classification scheme.
RiC-CM corresponding component: Corresponds to RiC-A40 (Structure attribute)

technical characteristics
type: DatatypeProperty
domain: Mechanism
range: Literal
comment: Describes any relevant physical or software feature of any device involved in the creation or management of a Record Resource.
label: características técnicas @es
label: caractéristiques techniques @fr
change note: Aligned with RiC-CM 1.0: updated the description (rdfs:comment), skos:scopeNote.
  date: 2023-11-11
change note: Added a new rdfs:label in Spanish.
  date: 2023-11-02
change note: Added a new rdfs:label in French.
  date: 2023-08-25
change note: Scope note and examples added. Objective: to make RiC-O compliant with RiC-CM v0.2.
  date: 2020-11-01
example: Hubble Space Telescope had until 2002 a flawed mirror that introduced severe spherical aberration for the images.
scope note: Does not include references to the workflow that the Mechanism is involved in, which is described under the Activity entity. It emphasizes those features that provide a better understanding of the impact of the Mechanism on the records.
RiC-CM corresponding component: Corresponds to RiC-A41 (Technical Characteristics attribute)

textual value
type: DatatypeProperty
domain: Class
  union of: Appellation
  union of: Date
  union of: Extent
range: Literal
comment: A textual expression of an Appellation or Date.
label: valeur textuelle @fr
label: valor textual @es
change note: Added a new rdfs:label in Spanish.
  date: 2023-11-02
change note: Added a new rdfs:label in French.
  date: 2023-08-25

title
type: DatatypeProperty
sub property of: name
domain: Class
  union of: Instantiation
  union of: Record Resource
  union of: Rule
range: Literal
comment: An identifying name of a Record Resource, Instantiation or Rule.
label: intitulé @fr
label: título @es
change note: Added a new rdfs:label in Spanish.
  date: 2023-11-02
change note: Added a new rdfs:label in French.
  date: 2023-08-25
scope note: Use only if you don't use Title class for handling titles.
RiC-CM corresponding component: Specialization of RiC-A28 (Name attribute)

type
type: DatatypeProperty
domain: Thing
range: Literal
comment: A term used to characterize an entity.
label: tipo @es
change note: Added a new rdfs:label in Spanish.
  date: 2023-11-02
change note: Added a new rdfs:label in French.
  date: 2023-08-25
scope note: Provided for usability reasons. May be deprecated and removed later on. Use only if you don't use Type subclasses for handling categories.

unit of measurement
type: DatatypeProperty
domain: Extent
range: Literal
comment: A definite magnitude of a quantity, defined and adopted by convention or by law, that is used as a standard for measurement of the same kind of quantity. Can be spacial units (cm, m), weight (g, kg), time (s, h), storage (MB, TB) or more informal units used in the archival context like number of boxes, pages or words.
label: unidad de medida @es
label: unité de mesure @fr
change note: Added a new rdfs:label in Spanish.
  date: 2023-11-02
change note: Added an xml:lang attribute to the rdfs:comment.
  date: 2023-08-28
change note: Added a new rdfs:label in French.
  date: 2023-08-25
change note: Added a scope note.
  date: 2020-11-21
change note: Datatype property created along with quantity, Extent and UnitOfMeasurement classes, in order to provide methods for handling extent accurately.
  date: 2020-10-28
scope note: Use if you do not use the UnitOfMeasurement class for handling units of measurement along with Extent.

used from date
type: DatatypeProperty
sub property of: beginning date
domain: Appellation
range: Literal
comment: Date at which an Appellation was first used.
label: usado desde la fecha @es
label: utilisé à partir de @fr
change note: Made this property a subproperty of beginningDate.
  date: 2023-11-12
change note: Added a new rdfs:label in Spanish.
  date: 2023-11-02
change note: Added a new rdfs:label in French.
  date: 2023-08-25
scope note: Provided for usability reasons. May be deprecated and removed later on. Use only if you don't use Date classes for handling dates.
RiC-CM corresponding component: Datatype property specialized implementation of RiC-E18 (Date entity)

used to date
type: DatatypeProperty
sub property of: end date
domain: Appellation
range: Literal
comment: Date until an Appellation was used.
label: usado hasta la fecha @es
label: utilisé jusqu’à @fr
change note: Made this property a subproperty of endDate.
  date: 2023-11-12
change note: Added a new rdfs:label in Spanish.
  date: 2023-11-02
change note: Added a new rdfs:label in French.
  date: 2023-08-25
scope note: Provided for usability reasons. May be deprecated and removed later on. Use only if you don't use Date classes for handling dates.
RiC-CM corresponding component: Datatype property specialized implementation of RiC-E18 (Date entity)

width
type: DatatypeProperty
sub property of: measure
domain: Thing
range: Literal
comment: Horizontal dimension of an entity.
label: anchura @es
label: largeur @fr
change note: Added a new rdfs:label in Spanish.
  date: 2023-11-02
change note: Added a new rdfs:label in French.
  date: 2023-08-25

Accumulation Relation
type: Class
equivalent class: Restriction
  on property: has the role of the Accumulation Relation
  has self: true
subclass of: Organic Provenance Relation
subclass of: Restriction
  on property: relation has source
  min qualified cardinality: 1
  on class: Class
    union of: Instantiation
    union of: Record Resource
subclass of: Restriction
  on property: relation has target
  min qualified cardinality: 1
  on class: Agent
comment: Connects at least one Record Resource or Instantiation to at least one Agent, when the Record Resource or Instantiation is or was accumulated by the Agent, be it intentionally (collecting it) or not (receiving it in the course of its activities). The Record Resource(s) or Instantiation(s) is the source of the Relation, and the Agent(s) is the target.
label: Recordressource/Instanz-Akteur-Bestandsbildung @de
label: Relación de acumulación @es
label: Relation d’accumulation @fr
change note: Added a new rdfs:label in German.
  date: 2025-04-08
change note: Improved the description of the Relation class (rdfs:comment) by clearly specifying how it is directed.
  date: 2023-12-06
change note: Aligned with RiC-CM 1.0: updated the description (rdfs:comment).
  date: 2023-11-12
change note: In order to get a system of rolified Relation classes: added an equivalentClass object property; replaced the specific object properties by the generic ones in the subClassOf declarations.
  date: 2023-11-08
change note: Added a new rdfs:label in Spanish.
  date: 2023-11-02
change note: Added a new rdfs:label in French.
  date: 2023-08-25
RiC-CM corresponding component: Class implementation of RiC-R028 and RiC-R028i relations

Activity
type: Class
subclass of: Event
comment: The doing of something for some human purpose.
label: Actividad @es
label: Activité @fr
label: Aktivität @de
change note: Added a new rdfs:label in German.
  date: 2025-04-08
change note: Added a new rdfs:label in Spanish.
  date: 2023-11-02
change note: Added a new rdfs:label in French.
  date: 2023-08-25
change note: Removed the 0.2 existing unnecessary restriction.
  date: 2023-04-19
change note: Scope note: made separate paragraphs and updated. Objective: to make RiC-O compliant with RiC-CM v0.2.
  date: 2020-10-23
scope note: Activity is a kind of Event. Activity is specifically used to designate purposeful human activity. Activity may be understood from two perspectives. First it can be understood as leading to an end. The end is the purpose of the Activity, or why the Activity is performed. Second, it can be understood in terms of the processes that lead to achieving the end, how the end is realized through coordinated actions. Purpose and process are complementary understandings of Activity. Together the two perspectives address why the Activity is performed, the expected ends or outcomes; and how the Activity fulfills the purpose. While activity has an intended end, it also has unintended consequences and results, or side-effects. By and large, these may not be the focus of the description, but they are, unquestionably, context. |In a corporate or government context an Activity may also be called a 'function'. An Activity exists in a specific social and cultural context, and within that context is subject to change over time. An Activity may be composed of other Activities.
RiC-CM corresponding component: Corresponds to RiC-E15 (Activity entity)

Activity Documentation Relation
type: Class
equivalent class: Restriction
  on property: has the role of the Activity Documentation Relation
  has self: true
subclass of: Event Relation
subclass of: Organic or functional provenance Relation
subclass of: Restriction
  on property: relation has source
  min qualified cardinality: 1
  on class: Class
    union of: Instantiation
    union of: Record Resource
subclass of: Restriction
  on property: relation has target
  min qualified cardinality: 1
  on class: Activity
comment: Connects at least one Record Resource or Instantiation to at least one Activity, when the Record Resource or Instantiation results from the Activity. The Record Resource(s) or Instantiation(s) is the source of the Relation, and the Activity(-ies) is the target.
label: Recordressource/Instanz-Aktivität @de
label: Relación de procedencia funcional @es
label: Relation entre activités et ressources archivistiques @fr
change note: Added a new rdfs:label in German.
  date: 2025-04-08
change note: Improved the description of the Relation class (rdfs:comment) by clearly specifying how it is directed.
  date: 2023-12-06
change note: Aligned with RiC-CM 1.0: updated the .
  date: 2023-11-12
change note: In order to get a system of rolified Relation classes: added an equivalentClass object property; replaced the specific object properties by the generic ones in the subClassOf declarations.
  date: 2023-11-08
change note: Made this relation a subclass of EventRelation.
  date: 2023-11-08
change note: Added a new rdfs:label in Spanish.
  date: 2023-11-02
change note: Added a new rdfs:label in French.
  date: 2023-08-25
RiC-CM corresponding component: Class implementation of RiC-R033 and RiC-R033 relations

Activity Type
type: Class
subclass of: Type
comment: Categorization of an Activity.
label: Aktivitätskategorie @de
label: Tipo de actividad @es
label: Type d’activité @fr
change note: Added a new rdfs:label in German.
  date: 2025-04-08
change note: Added a new rdfs:label in Spanish.
  date: 2023-11-02
change note: Added a new rdfs:label in French.
  date: 2023-08-25
change note: Removed the 0.2 existing unnecessary restriction.
  date: 2023-04-19
change note: Scope note: updated (different from RiC-CM scope note). Objective: to make RiC-O compliant with RiC-CM v0.2.
  date: 2020-10-23
scope note: Can be extended with any number of subclasses, e.g. “function/action” and “activity domain”. This allows for a faceted approach that enables an Activity to be categorized using a combination of components, general or more specific. For example, “monitoring” can be used in combination with “election polls” or “water resources”.
RiC-CM corresponding component: Corresponds to RiC-A02 (Activity Type attribute)

Agent
type: Class
subclass of: Thing
comment: A Person, or Group, or an entity created by a Person or Group (Mechanism), or a Position, that acts in the world.
label: Agente @es
label: Akteur @de
change note: Added a new rdfs:label in German.
  date: 2025-04-08
change note: Added a new rdfs:label in Spanish.
  date: 2023-11-02
change note: Added a new rdfs:label in French.
  date: 2023-08-25
change note: removed the Restrictions
  date: 2021-02-08
change note: Comment: updated. Scope note: updated and made several paragraphs. Objective: to make RiC-O compliant with RiC-CM v0.2.
  date: 2020-10-23
scope note: An Agent may have one or more identities; an identity is a constellation of properties or relations that together “identify” the Agent. A Person or Group commonly has one identity, though each also may have one or more alternative identities. Such alternative identities may be shared by more than one Person or Group. Alternative identities include but are not limited to pseudonyms, heteronyms, DBA (Doing Business As), and trade identities. An alternative identity should not be confused with a Position in a Group, for example, presidents, prime ministers, governors, popes, royalty, or bishops. Nor should an alternative identity be confused with a variant name or identifier of the same identity. Agent also includes entities created by a Person or Group that act on behalf of the creating Agent in an autonomous or semi-autonomous manner. Examples of a Mechanism include software agents, robots, and space and underwater probes that generate data (records) in the course of Activity assigned to and in conformance with the instructions given to them by the creating Person or Group.
RiC-CM corresponding component: Corresponds to RiC-E07 (Agent entity)

Agent Control Relation
type: Class
equivalent class: Restriction
  on property: has the role of the Agent Control Relation
  has self: true
subclass of: Agent Hierarchical Relation
subclass of: Authority Relation
subclass of: Restriction
  on property: relation has source
  min qualified cardinality: 1
  on class: Agent
subclass of: Restriction
  on property: relation has target
  min qualified cardinality: 1
  on class: Agent
comment: Connects at least one Agent, to at least another Agent, when the first one(s) control(s) or controlled in a way the activities of the second one(s). The Relation is oriented from the controlling agent to the controlled one: the controlling Agent(s) is the source of the Relation, and the controlled Agent(s) is the target.
label: Akteur-Kontrolle-Akteur @de
label: Relación de control entre agentes @es
label: Relation de contrôle entre agents @fr
change note: Added a new rdfs:label in German.
  date: 2025-04-08
change note: Improved the description of the Relation class (rdfs:comment) by clearly specifying how it is directed.
  date: 2023-12-06
change note: Aligned with RiC-CM 1.0: updated the description (rdfs:comment).
  date: 2023-11-12
change note: In order to get a system of rolified Relation classes: added an equivalentClass object property; replaced the specific object properties by the generic ones in the subClassOf declarations.
  date: 2023-11-08
change note: Added a new rdfs:label in Spanish.
  date: 2023-11-02
change note: Added a new rdfs:label in French.
  date: 2023-08-25
RiC-CM corresponding component: Class implementation of RiC-R041 and RiC-R041i relations

Agent Hierarchical Relation
type: Class
equivalent class: Restriction
  on property: has the role of the Agent Hierarchical Relation
  has self: true
subclass of: Agent Relation
subclass of: Restriction
  on property: relation has source
  min qualified cardinality: 1
  on class: Agent
subclass of: Restriction
  on property: relation has target
  min qualified cardinality: 1
  on class: Agent
comment: Connects at least one Agent to at least another Agent, when the first one is or was hierarchically superior to the second one. The Relation is oriented towards the 'bottom' of the hierarchical tree: the superior Agent(s) is the source of the Relation, and the inferior Agent(s) is the target.
label: Akteur-Hierarchie-Akteur @de
label: Relación jerárquica entre agentes @es
label: Relation hiérarchique entre agents @fr
change note: Added a new rdfs:label in German.
  date: 2025-04-08
change note: Improved the description of the Relation class (rdfs:comment) by clearly specifying how it is directed.
  date: 2023-12-06
change note: Aligned with RiC-CM 1.0: updated the description (rdfs:comment), skos:scopeNote.
  date: 2023-11-12
change note: In order to get a system of rolified Relation classes: added an equivalentClass object property; replaced the specific object properties by the generic ones in the subClassOf declarations.
  date: 2023-11-08
change note: Added a new rdfs:label in Spanish.
  date: 2023-11-02
change note: Added a new rdfs:label in French.
  date: 2023-08-25
scope note: The hierarchical relation can be an authority relation, or a whole/part relation between two agents.
RiC-CM corresponding component: Class implementation of RiC-R045 and RiC-R045i relations

Agent Name
type: Class
subclass of: Name
comment: A label, title or term designating an Agent in order to make it distinguishable from other similar entities.
label: Akteursname @de
label: Nombre de Agente @es
label: Nom d’agent @fr
change note: Added a new rdfs:label in German.
  date: 2025-04-08
change note: Added a new rdfs:label in Spanish.
  date: 2023-11-02
change note: Added a new rdfs:label in French.
  date: 2023-08-25
RiC-CM corresponding component: Class implementation of a specialization of RiC-A28 (Name attribute)

Agent Temporal Relation
type: Class
equivalent class: Restriction
  on property: has the role of the Agent Temporal Relation
  has self: true
subclass of: Agent Relation
subclass of: Temporal Relation
subclass of: Restriction
  on property: relation has source
  min qualified cardinality: 1
  on class: Agent
subclass of: Restriction
  on property: relation has target
  min qualified cardinality: 1
  on class: Agent
comment: Connects at least one Agent to at least another Agent that succeeds it chronologically for, for instance, fullfilling some functions or performing some activities. The Relation is oriented chronologically, from the predecessor to the successor: the predecessor Agent(s) is the source of the Relation, and the successor Agent(s) is the target.
label: Akteur-Nachfolge @de
label: Relación temporal entre agentes @es
label: Relation temporelle entre agents @fr
change note: Added a new rdfs:label in German.
  date: 2025-04-08
change note: Improved the description of the Relation class (rdfs:comment) by clearly specifying how it is directed.
  date: 2023-12-06
change note: Aligned with RiC-CM 1.0: updated the skos:scopeNote.
  date: 2023-11-12
change note: In order to get a system of rolified Relation classes: added an equivalentClass object property; replaced the specific object properties by the generic ones in the subClassOf declarations.
  date: 2023-11-08
change note: Added a new rdfs:label in Spanish.
  date: 2023-11-02
change note: Added a new rdfs:label in French.
  date: 2023-08-25
change note: Removed the 0.2 existing unnecessary restriction.
  date: 2023-04-19
scope note: There may be zero to many intermediate agents, ignored or unknown, between the two connected agents. Can be used when there is a transfer of function from the first agent to the second agent.
RiC-CM corresponding component: Class implementation of RiC-R016 and RiC-016i relations

Agent Relation
type: Class
equivalent class: Restriction
  on property: has the role of the Agent Relation
  has self: true
subclass of: Relation
subclass of: Restriction
  on property: relation connects
  min qualified cardinality: 2
  on class: Agent
comment: Connects at least two Agents. This Relation is a generic, not oriented one.
label: Akteur-Akteur @de
label: Relación entre agentes @es
label: Relation entre agents @fr
change note: Added a new rdfs:label in German.
  date: 2025-04-08
change note: Improved the description of the Relation class (rdfs:comment) by clearly specifying how it is directed.
  date: 2023-12-06
change note: Aligned with RiC-CM 1.0: updated the skos:scopeNote.
  date: 2023-11-12
change note: In order to get a system of rolified Relation classes: added an equivalentClass object property; replaced the specific object properties by the generic ones in the subClassOf declarations.
  date: 2023-11-08
change note: Added a new rdfs:label in Spanish.
  date: 2023-11-02
change note: Added a new rdfs:label in French.
  date: 2023-08-25
scope note: Use only if it is not possible to specify a narrower agent to agent relation, for example a WorkRelation.
RiC-CM corresponding component: Class implementation of RiC-R044 and RiC-044i relations

Appellation
type: Class
subclass of: Concept
comment: A concept of any kind that is used for designating an Entity and referring to it.
label: Bezeichnung @de
label: Denominación @es
change note: Added a new rdfs:label in German.
  date: 2025-04-08
change note: Added a new rdfs:label in Spanish.
  date: 2023-11-02
change note: Added a new rdfs:label in French.
  date: 2023-08-25

Appellation Relation
type: Class
equivalent class: Restriction
  on property: has the role of the Appellation Relation
  has self: true
subclass of: Relation
subclass of: Restriction
  on property: relation has source
  qualified cardinality: 1
  on class: Appellation
subclass of: Restriction
  on property: relation has target
  min qualified cardinality: 1
  on class: Thing
comment: Connects an Appellation and at least one Thing that the Appellation designates or designated. The Appellation is the source of the Relation and the Thing(s) is the target.
label: Bezeichnung-Ding @de
label: Relación de denominación @es
label: Relation d’appellation @fr
change note: Added a new rdfs:label in German.
  date: 2025-04-08
change note: Improved the description of the Relation class (rdfs:comment) by clearly specifying how it is directed.
  date: 2023-12-06
change note: Aligned with RiC-CM 1.0: updated the description (rdfs:comment).
  date: 2023-11-12
change note: In order to get a system of rolified Relation classes: added an equivalentClass object property; replaced the specific object properties by the generic ones in the subClassOf declarations.
  date: 2023-11-08
change note: Added a new rdfs:label in Spanish.
  date: 2023-11-02
change note: Added a new rdfs:label in French.
  date: 2023-08-25

Authority Relation
type: Class
equivalent class: Restriction
  on property: has the role of the Authority Relation
  has self: true
subclass of: Relation
subclass of: Restriction
  on property: relation has source
  min qualified cardinality: 1
  on class: Agent
subclass of: Restriction
  on property: relation has target
  min qualified cardinality: 1
  on class: Thing
comment: Connects at least one Agent and at least one Thing over which the Agent has or had some authority. The Agent(s) is the source of the relation, and the Thing(s) is the target.
label: Akteur-Autorität-Ding @de
label: Relación de control por parte de agentes @es
label: Relation d’autorité @fr
change note: Added a new rdfs:label in German.
  date: 2025-04-08
change note: Improved the description of the Relation class (rdfs:comment) by clearly specifying how it is directed.
  date: 2023-12-06
change note: Aligned with RiC-CM 1.0: updated the description (rdfs:comment), skos:scopeNote.
  date: 2023-11-12
change note: In order to get a system of rolified Relation classes: added an equivalentClass object property; replaced the specific object properties by the generic ones in the subClassOf declarations.
  date: 2023-11-08
change note: Added a new rdfs:label in Spanish.
  date: 2023-11-02
change note: Added a new rdfs:label in French.
  date: 2023-08-25
scope note: Use only if it is not possible to specify a narrower authority relation, for example OwnershipRelation.
RiC-CM corresponding component: Class implementation of RiC-R036 and RiC-R036i relations

Authorship Relation
type: Class
equivalent class: Restriction
  on property: has the role of the Authorship Relation
  has self: true
subclass of: Creation Relation
subclass of: Restriction
  on property: relation has source
  min qualified cardinality: 1
  on class: Documento
subclass of: Restriction
  on property: relation has target
  min qualified cardinality: 1
  on class: Class
    union of: Group
    union of: Person
    union of: Position
comment: Connects at least one Record to at least one Person, Group or Position that is or was responsible for conceiving and formulating the information contained in the Record. The Record is the source of the Relation and the Person(s), Group(s) or Position(s) is the target.
label: Record-Autor-Akteur @de
label: Relación de autoría @es
label: Relation de responsabilité intellectuelle @fr
change note: Added a new rdfs:label in German.
  date: 2025-04-08
change note: Improved the description of the Relation class (rdfs:comment) by clearly specifying how it is directed.
  date: 2023-12-06
change note: Aligned with RiC-CM 1.0: updated the description (rdfs:comment), skos:scopeNote.
  date: 2023-11-12
change note: In order to get a system of rolified Relation classes: added an equivalentClass object property; replaced the specific object properties by the generic ones in the subClassOf declarations.
  date: 2023-11-08
change note: Added a new rdfs:label in Spanish.
  date: 2023-11-02
change note: Added a new rdfs:label in French.
  date: 2023-08-25
change note: Created following the addition of RiC-R079 relation in RiC-CM 0.2
  date: 2020-12-29
scope note: To be used for a person, group or position that makes any contribution to the content of a record. Includes the person, group or position in whose name or by whose command the content may have been formulated and first instantiated (for example the person who signed the record).
RiC-CM corresponding component: Class implementation of RiC-R079 and RiC-R079i relations

Carrier Extent
type: Class
subclass of: Extent
comment: Number of physical units and/or physical dimensions of the carrier of an Instantiation.
label: Datenträgerumfang @de
label: Extensión del soporte @es
label: Mesure d’un support @fr
change note: Added a new rdfs:label in German.
  date: 2025-04-08
change note: Aligned with RiC-CM 1.0: updated the description (rdfs:comment), skos:scopeNote.
  date: 2023-11-12
change note: Added a new rdfs:label in Spanish.
  date: 2023-11-02
change note: Added a new rdfs:label in French.
  date: 2023-08-25
change note: Changed a bit the definition and added change notes.
  date: 2020-11-21
change note: Class added in order to handle an accurate description of a carrier extent
  date: 2020-10-28
scope note: In order to manage an instantiation of a record resource it is necessary to note the extent of the carrier as well as that of the instantiation itself. Whether it is necessary to note dimensions, the number of relevant units or both depends on the nature of the carrier and particular business needs.
RiC-CM corresponding component: Class implementation of RiC-A04 (Carrier Extent) attribute

Carrier Type
type: Class
subclass of: Type
comment: Categorization of physical material on which information is represented.
label: Datenträgerkategorie @de
label: Tipo de soporte @es
label: Type de support @fr
change note: Added a new rdfs:label in German.
  date: 2025-04-08
change note: Aligned with RiC-CM 1.0: updated the description (rdfs:comment), skos:scopeNote.
  date: 2023-11-12
change note: Added a new rdfs:label in Spanish.
  date: 2023-11-02
change note: Added a new rdfs:label in French.
  date: 2023-08-25
change note: Removed the 0.2 existing unnecessary restriction.
  date: 2023-04-19
change note: Scope note: updated (quite the same as RiC-CM definition). Objective: to make RiC-O compliant with RiC-CM v0.2.
  date: 2020-10-23
scope note: In order to manage an instantiation of a record resource, it is necessary to note the type of carrier on which the record resource is instantiated as its nature will determine the environmental storage conditions and the prerequisites for and possible ways of accessing and using the record resource.
RiC-CM corresponding component: Corresponds to RiC-A05 (Carrier Type attribute)

Child Relation
type: Class
equivalent class: Restriction
  on property: has the role of the Child Relation
  has self: true
subclass of: Descendance Relation
subclass of: Restriction
  on property: relation has source
  min qualified cardinality: 1
  on class: Person
subclass of: Restriction
  on property: relation has target
  min qualified cardinality: 1
  on class: Person
comment: Connects at least one Person to at least another Person, when the first has(ave) child(s) the second one(s). The Relation is oriented from the parent to the child: the parent is the source of the relation, and the child(ren) is the target.
label: Person-Kind @de
label: Relación de filiación @es
label: Relation de filiation @fr
change note: Added a new rdfs:label in German.
  date: 2025-04-08
change note: Improved the description of the Relation class (rdfs:comment) by clearly specifying how it is directed.
  date: 2023-12-06
change note: Aligned with RiC-CM 1.0: updated the description (rdfs:comment).
  date: 2023-11-12
change note: In order to get a system of rolified Relation classes: added an equivalentClass object property; replaced the specific object properties by the generic ones in the subClassOf declarations.
  date: 2023-11-08
change note: Added a new rdfs:label in Spanish.
  date: 2023-11-02
change note: Added a new rdfs:label in French.
  date: 2023-08-25
RiC-CM corresponding component: Class implementation of RiC-R018 and RiC-R018i relations

Concept
type: Class
subclass of: Thing
comment: An idea, unit of thought, abstract cultural object or category
label: Concepto @es
label: Konzept @de
change note: Added a new rdfs:label in German.
  date: 2025-04-08
change note: Added a new rdfs:label in Spanish.
  date: 2023-11-02
change note: Added a new rdfs:label in French.
  date: 2023-08-25

Content Type
type: Class
subclass of: Type
comment: The fundamental form of communication in which a Record or Record Part is expressed.
label: Inhaltskategorie @de
label: Tipo de contenido @es
label: Type de contenu @fr
change note: Added a new rdfs:label in German.
  date: 2025-04-08
change note: Aligned with RiC-CM 1.0: updated the description (rdfs:comment), skos:scopeNote.
  date: 2023-11-12
change note: Added a new rdfs:label in Spanish.
  date: 2023-11-02
change note: Added a new rdfs:label in French.
  date: 2023-08-25
change note: Removed the 0.2 existing unnecessary restriction.
  date: 2023-04-19
change note: Scope note: added (quite the same as RiC-CM definition).
  date: 2020-10-23
scope note: Content Type should not be confused with Representation Type or Carrier Type that would concern a related Instantiation since the form of communication can be independent of the representation or carrier, for example a map (content type "cartographic image") may be represented as a sketch (representation type "visual") recorded as a physical document (carrier type "paper"). It also should not be confused with the Documentary Form Type of a Record, or Record Part, which describes a specific document form (for example a deed of sale).
RiC-CM corresponding component: Corresponds to RiC-A10 (Content Type attribute)

Coordinates
type: Class
subclass of: Thing
comment: Longitudinal and latitudinal information about a Place.
label: Coordenadas de lugar @es
label: Coordonnées géographiques @fr
label: Koordinaten @de
change note: Added a new rdfs:label in German.
  date: 2025-04-08
change note: Aligned with RiC-CM 1.0: updated the description (rdfs:comment).
  date: 2023-11-12
change note: Added a new rdfs:label in Spanish.
  date: 2023-11-02
change note: Added a new rdfs:label in French.
  date: 2023-08-25
change note: Removed the 0.2 existing unnecessary restriction.
  date: 2023-04-19
change note: Removed the cardinality Restrictions when the range is a datatype property
  date: 2021-02-08
RiC-CM corresponding component: Class implementation of RiC-A11 (Coordinates attribute)

Corporate Body
type: Class
subclass of: Group
comment: An organized group of persons that act together as an Agent, and that has a recognized legal or social status.
label: Collectivité @fr
label: Institución @es
label: Körperschaft @de
change note: Added a new rdfs:label in German.
  date: 2025-04-08
change note: Aligned with RiC-CM 1.0: updated the description (rdfs:comment), skos:scopeNote.
  date: 2023-11-12
change note: Added a new rdfs:label in Spanish.
  date: 2023-11-02
change note: Added a new rdfs:label in French.
  date: 2023-08-25
change note: Added a new rdfs:label in French.
  date: 2023-08-25
change note: scope note: updated. Objective: to make RiC-O compliant with RiC-CM v0.2.
  date: 2020-10-23
scope note: Corporate body is a kind of Group (RiC-E09). By exception, within some legal contexts, a sole trader or sole proprietor may be recognized as a corporate body, even when the economic enterprise does not have additional members. Corporate bodies often have a mandate giving them the authority to act within their area(s) of competence. They will also usually act within a particular jurisdiction being governed by legal and other rule-based frameworks. A corporate body though may be constituted in a more informal manner and exist as an entity by virtue of its recognition as such by its members.
RiC-CM corresponding component: Corresponds to RiC-E11 (Corporate Body entity)

Corporate Body Type
type: Class
subclass of: Type
comment: Categorization of a Corporate Body.
label: Körperschaftskategorie @de
label: Tipo de institución @es
label: Type de collectivité @fr
change note: Added a new rdfs:label in German.
  date: 2025-04-08
change note: Added a new rdfs:label in Spanish.
  date: 2023-11-02
change note: Added a new rdfs:label in French.
  date: 2023-08-25
change note: Removed the 0.2 existing unnecessary restriction.
  date: 2023-04-19
RiC-CM corresponding component: Corresponds to RiC-A12 (Corporate Body Type attribute)

Correspondence Relation
type: Class
equivalent class: Restriction
  on property: has the role of the Correspondence Relation
  has self: true
subclass of: Knowing Relation
subclass of: Restriction
  on property: relation connects
  min qualified cardinality: 2
  on class: Person
comment: Connects at least two Persons, when they correspond or corresponded to each other. This Relation is not oriented.
label: Person-Korrespondenz-Person @de
label: Relación entre personas por correspondencia @es
label: Relation épistolaire @fr
change note: Added a new rdfs:label in German.
  date: 2025-04-08
change note: Improved the description of the Relation class (rdfs:comment) by clearly specifying how it is directed.
  date: 2023-12-06
change note: Aligned with RiC-CM 1.0: updated the description (rdfs:comment).
  date: 2023-11-12
change note: In order to get a system of rolified Relation classes: added an equivalentClass object property; replaced the specific object properties by the generic ones in the subClassOf declarations.
  date: 2023-11-08
change note: Added a new rdfs:label in Spanish.
  date: 2023-11-02
change note: Added a new rdfs:label in French.
  date: 2023-08-25
RiC-CM corresponding component: Class implementation of RiC-R052 and Ri052i relations

Creation Relation
type: Class
equivalent class: Restriction
  on property: has the role of the Creation Relation
  has self: true
subclass of: Organic Provenance Relation
subclass of: Restriction
  on property: relation has source
  min qualified cardinality: 1
  on class: Class
    union of: Instantiation
    union of: Record Resource
subclass of: Restriction
  on property: relation has target
  min qualified cardinality: 1
  on class: Agent
comment: Connects at least one Record Resource or Instantiation to at least one Agent, when the Agent is either responsible for all or some of the content of the Record Resource, or is a contributor to the genesis or production of the Instantiation. The Record Resource or Instantiation is the source of the Relation, and the Agent(s) is the target.
label: Recordressource/Instanz-Erstellung-Akteur @de
label: Relación de creación @es
label: Relation de création @fr
change note: Added a new rdfs:label in German.
  date: 2025-04-08
change note: Improved the description of the Relation class (rdfs:comment) by clearly specifying how it is directed.
  date: 2023-12-06
change note: Aligned with RiC-CM 1.0: updated the skos:scopeNote.
  date: 2023-11-12
change note: In order to get a system of rolified Relation classes: added an equivalentClass object property; replaced the specific object properties by the generic ones in the subClassOf declarations.
  date: 2023-11-08
change note: Added a new rdfs:label in Spanish.
  date: 2023-11-02
change note: Added a new rdfs:label in French.
  date: 2023-08-25
change note: Removed a 0.2 existing unnecessary restriction.
  date: 2023-04-19
scope note: Covers the definition of "author" in diplomatics, and any agent that makes a contribution to the intellectual content of a record resource. Can also be used for any agent that was involved in the genesis (e.g. with the role of witness, representative of the author etc.) or in the production (e.g. with the role of scribe, secretary, notary, printer etc.) of the record resource or instantiation.
RiC-CM corresponding component: Class implementation of RiC-R027 and RiC-R027i relations

Date
type: Class
subclass of: Thing
comment: Chronological information associated with an entity that contributes to its identification and contextualization.
label: Datum @de
label: Fecha @es
change note: Added a new rdfs:label in German.
  date: 2025-04-08
change note: Aligned with RiC-CM 1.0: updated the skos:scopeNote.
  date: 2023-11-12
change note: Added a new rdfs:label in Spanish.
  date: 2023-11-02
change note: Added a new rdfs:label in French.
  date: 2023-08-25
change note: Scope note: made separate paragraphs.
  date: 2020-10-23
scope note: A Date may be represented in natural language, based on a digital standard, or both. Digital standard dates will typically be based on ISO 8601, or Extended Date-Time Format (EDTF)
RiC-CM corresponding component: Corresponds to RiC-E18 (Date entity)

Date Type
type: Class
subclass of: Type
comment: Categorization of a Date.
label: Datumskategorie @de
label: Tipo de fecha @es
label: Type de date @fr
change note: Added a new rdfs:label in German.
  date: 2025-04-08
change note: Aligned with RiC-CM 1.0: updated the description (rdfs:comment), skos:scopeNote. Added a label in Spanish.
  date: 2023-11-12
change note: Added the rdfs:comment, a French rdfs:label, and adjusted the rico:RiCCMCorrespondingComponent annotation.
  date: 2023-10-10
change note: Added in RiC-O 1.0.
  date: 2023-09-22
scope note: May be used to categorize a Date as a single date, a date range or a date set or sub-categories of these broad types. This attribute should not be confused with the date relations defined to connect a Date entity and any other entity (such as RiC-R069 ‘is beginning date of’).
RiC-CM corresponding component: Corresponds to RiC-A42 (Date Type attribute) (new in RiC-CM 1.0).

Demographic Group
type: Class
subclass of: Type
comment: Categorization of a Person or Group based on shared characteristics.
label: Demographische Gruppe @de
label: Groupe démographique @fr
label: Grupo demográfico @es
change note: Added a new rdfs:label in German.
  date: 2025-04-08
change note: Changed the French and Spanish labels (replaced 'catégorie' and 'categoria' with 'groupe' and 'grupo').
  date: 2024-10-10
change note: Aligned with RiC-CM 1.0: updated the description (rdfs:comment), skos:scopeNote.
  date: 2023-11-12
change note: Added a new rdfs:label in Spanish.
  date: 2023-11-02
change note: Added a new rdfs:label in French.
  date: 2023-08-25
change note: Removed the Restriction.
  date: 2021-02-08
change note: Comment: updated. Scope note: updated and made several paragraphs. Objective: to make RiC-O compliant with RiC-CM v0.2.
  date: 2020-10-23
scope note: Can be extended with any number of specific subclasses. Among possible specific demographic groups are gender, (biological) sex, education, identity, place, ancestry, ethnic/cultural identification, and religion.
RiC-CM corresponding component: Corresponds to RiC-A15 (Demographic Group attribute)

Derivation Relation
type: Class
equivalent class: Restriction
  on property: has the role of the Derivation Relation
  has self: true
subclass of: Instantiation to Instantiation Relation
subclass of: Temporal Relation
subclass of: Restriction
  on property: relation has source
  qualified cardinality: 1
  on class: Instantiation
subclass of: Restriction
  on property: relation has target
  min qualified cardinality: 1
  on class: Instantiation
comment: Connects an Instantiation to at least one Instantiation that is derived from it, whether it exists or has been lost or destroyed. The Relation is oriented chronologically, from the first Instantiation in time to the derived Instantiation: the first Instantiation is the source of the Relation, and the derived Instantiation(s) is the target.
label: Instanz-Derivat-Instanz @de
label: Relación de derivación @es
label: Relation de dérivation @fr
change note: Added a new rdfs:label in German.
  date: 2025-04-08
change note: Improved the description of the Relation class (rdfs:comment) by clearly specifying how it is directed.
  date: 2023-12-06
change note: Aligned with RiC-CM 1.0: updated the description (rdfs:comment), skos:scopeNote.
  date: 2023-11-12
change note: In order to get a system of rolified Relation classes: added an equivalentClass object property; replaced the specific object properties by the generic ones in the subClassOf declarations.
  date: 2023-11-08
change note: Added a new rdfs:label in Spanish.
  date: 2023-11-02
change note: Added a new rdfs:label in French.
  date: 2023-08-25
scope note: In some situations, it may be useful or necessary to connect an instantiation to an instantiation that was derived from it but no longer exists or has been lost.
RiC-CM corresponding component: Class implementation of RiC-R014 and RiR014i relations

Descendance Relation
type: Class
equivalent class: Restriction
  on property: has the role of the Descendance Relation
  has self: true
subclass of: Agent Temporal Relation
subclass of: Family Relation
subclass of: Restriction
  on property: relation has source
  min qualified cardinality: 1
  on class: Person
subclass of: Restriction
  on property: relation has target
  min qualified cardinality: 1
  on class: Person
comment: Connects at least one Person to at least another Person, when the first has/have descendant the second one(s). The Relation is oriented from the ascendant to the descendant: the ascendant Person(s) is the source of the Relation, and the descendant Person(s) is the target.
label: Person-Nachkommen @de
label: Relación de descendencia @es
label: Relation de descendance @fr
change note: Added a new rdfs:label in German.
  date: 2025-04-08
change note: Improved the description of the Relation class (rdfs:comment) by clearly specifying how it is directed.
  date: 2023-12-06
change note: In order to get a system of rolified Relation classes: added an equivalentClass object property; replaced the specific object properties by the generic ones in the subClassOf declarations.
  date: 2023-11-08
change note: Added a new rdfs:label in Spanish.
  date: 2023-11-02
change note: Added a new rdfs:label in French.
  date: 2023-08-25
RiC-CM corresponding component: Class implementation of RiC-R017 and RiC-R017i relations

Documentary Form Type
type: Class
subclass of: Type
comment: Categorization of a Record or Record Part with respect to its extrinsic and intrinsic elements that together communicate its content, administrative and documentary context, and authority.
label: Dokumentenkategorie @de
label: Tipo documental @es
label: Type de document @fr
change note: Added a new rdfs:label in German.
  date: 2025-04-08
change note: Aligned with RiC-CM 1.0: updated the description (rdfs:comment).
  date: 2023-11-12
change note: Added a new rdfs:label in Spanish.
  date: 2023-11-02
change note: Added a new rdfs:label in French.
  date: 2023-08-25
change note: Removed the 0.2 existing unnecessary restriction.
  date: 2023-04-19
change note: Comment: updated. Scope note: made several paragraphs. Objective: to make RiC-O compliant with RiC-CM v0.2.
  date: 2020-10-23
scope note: Documentary Form Type plays an important role in determining the type of information a Record may comprise, its status of perfection, and its authenticity and reliability. Documentary form types exist in a specific social and cultural context, and within that context, are subject to change over time.
RiC-CM corresponding component: Corresponds to RiC-A17 (Documentary Form Type attribute)

Event
type: Class
subclass of: Thing
comment: Something that happens or occurs in time and space.
label: Ereignis @de
label: Événement @fr
label: Evento @es
change note: Added a new rdfs:label in German.
  date: 2025-04-08
change note: Aligned with RiC-CM 1.0: updated the description (rdfs:comment), skos:scopeNote.
  date: 2023-11-12
change note: Added a new rdfs:label in Spanish.
  date: 2023-11-02
change note: Added a new rdfs:label in French.
  date: 2023-08-25
change note: Removed the 0.2 existing unnecessary restriction.
  date: 2023-04-19
change note: Scope note: made separate paragraphs and some changes.
  date: 2020-10-23
scope note: An event may be caused by nature, an agent, or a combination of nature and agent. Events have temporal and spatial boundaries. An event may actively involve some agent(s) and affect any entity. An event may be discrete, happening at a specific moment in time, or may occur over an extended period of time. Events may have events as parts, and events may precede or follow one another. Multiple agents may participate in the same event, and in different roles.
RiC-CM corresponding component: Corresponds to RiC-E14 (Event entity)
close to: LODE Event class (http://linkedevents.org/ontology/#Event)

Event Relation
type: Class
equivalent class: Restriction
  on property: has the role of the Event Relation
  has self: true
subclass of: Relation
subclass of: Restriction
  on property: relation has source
  min qualified cardinality: 1
  on class: Event
subclass of: Restriction
  on property: relation has target
  min qualified cardinality: 1
  on class: Thing
comment: Connects at least one Event to at least one Thing, when the first is associated with the existence and lifecycle of the second one. The Event(s) is the source of the Relation, and the Thing(s) is the target.
label: Ereignis-Ding @de
label: Relación con un evento @es
label: Relation impliquant un événement @fr
change note: Added a new rdfs:label in German.
  date: 2025-04-08
change note: Improved the description of the Relation class (rdfs:comment) by clearly specifying how it is directed.
  date: 2023-12-06
change note: Aligned with RiC-CM 1.0: updated the skos:scopeNote.
  date: 2023-11-12
change note: In order to get a system of rolified Relation classes: added an equivalentClass object property; replaced the specific object properties by the generic ones in the subClassOf declarations.
  date: 2023-11-08
change note: Added a new rdfs:label in Spanish.
  date: 2023-11-02
change note: Added a new rdfs:label in French.
  date: 2023-08-25
scope note: Use to connect an event and an entity only if it is not possible to specify a narrower event relation, for example a PerformanceRelation.
RiC-CM corresponding component: Class implementation of RiC-R057 and RiC-R057i relations

Event Type
type: Class
subclass of: Type
comment: Categorization of an Event.
label: Ereigniskategorie @de
label: Tipo de evento @es
label: Type d’événement @fr
change note: Added a new rdfs:label in German.
  date: 2025-04-08
change note: Aligned with RiC-CM 1.0: updated the skos:scopeNote.
  date: 2023-11-12
change note: Added a new rdfs:label in Spanish.
  date: 2023-11-02
change note: Added a new rdfs:label in French.
  date: 2023-08-25
change note: Removed the 0.2 existing unnecessary restriction.
  date: 2023-04-19
change note: Scope note: updated and made several paragraphs. Objective: to make RiC-O compliant with RiC-CM v0.2.
  date: 2020-10-23
scope note: Events of all kinds can be categorized. Curation event types include creation; acquisition; transfer; arrangement; description; digitization, etc. Biographical event types include birth, marriage, death, etc.
RiC-CM corresponding component: Corresponds to RiC-A18 (Event Type attribute)

Extent
type: Class
subclass of: Thing
comment: Countable characteristics of the content of an entity expressed as a quantity.
label: Extensión @es
label: Mesure @fr
label: Umfang @de
change note: Added a new rdfs:label in German.
  date: 2025-04-08
change note: Added a new rdfs:label in Spanish.
  date: 2023-11-02
change note: Added a new rdfs:label in French.
  date: 2023-08-25
change note: Class added together with three subclasses and hasExtent and isExtentOf Object properties
  date: 2020-10-28
scope note: Physical or logical extent of a resource

Extent Type
type: Class
subclass of: Type
comment: Categorization of the extent that is being measured.
label: Tipo de Extensión @es
label: Type de mesure @fr
label: Umfangskategorie @de
change note: Added a new rdfs:label in German.
  date: 2025-04-08
change note: Added a new rdfs:label in Spanish.
  date: 2023-11-02
change note: Added an xml:lang attribute to the rdfs:comment.
  date: 2023-08-28
change note: Added a new rdfs:label in French.
  date: 2023-08-25
change note: Added to specify the dimension that is being measured
  date: 2020-11-01

Family
type: Class
subclass of: Group
comment: Two or more persons related by birth, or through marriage, adoption, civil union, or other social conventions that bind them together as a socially recognized familial group.
label: Familia @es
label: Familie @de
label: Famille @fr
change note: Added a new rdfs:label in German.
  date: 2025-04-08
change note: Added a new rdfs:label in Spanish.
  date: 2023-11-02
change note: Added a new rdfs:label in French.
  date: 2023-08-25
change note: Scope note: made separate paragraphs and some changes.
  date: 2020-10-23
scope note: Family is a kind of Group. “Family” is used here as a general term that encompasses a wide variety of familial groups. Other types of familial groups include Dynasty, Clan, House, Tribe and others. Though family may be a recognized legal group in specific contexts, the term may also be used for groups that are socially recognized as families. A family may be a group of persons related either by consanguinity or affinity or cohabitation or other social conventions. In some context, a Family may be legally recognized as Corporate Body. For example, certain North American peoples (tribes) retain self-government rights and have jurisdiction over defined tribal lands.
RiC-CM corresponding component: Corresponds to RiC-E10 (Family entity)

Family Relation
type: Class
equivalent class: Restriction
  on property: has the role of the Family Relation
  has self: true
subclass of: Agent Relation
subclass of: Restriction
  on property: relation connects
  min qualified cardinality: 2
  on class: Person
comment: Connects at least two Persons, when they have some family link, i.e. belong to the same family. This Relation is a generic, not oriented one.
label: Person-Familie-Person @de
label: Relación familiar @es
label: Relation familiale @fr
change note: Added a new rdfs:label in German.
  date: 2025-04-08
change note: Improved the description of the Relation class (rdfs:comment) by clearly specifying how it is directed.
  date: 2023-12-06
change note: Aligned with RiC-CM 1.0: updated the skos:scopeNote.
  date: 2023-11-12
change note: In order to get a system of rolified Relation classes: added an equivalentClass object property; replaced the specific object properties by the generic ones in the subClassOf declarations.
  date: 2023-11-08
change note: Added a new rdfs:label in Spanish.
  date: 2023-11-02
change note: Added a new rdfs:label in French.
  date: 2023-08-25
scope note: Use the MembershipRelation class for connecting a family and a person.
RiC-CM corresponding component: Class implementation of RiC-R047 and RiC-R047i relations

Family Type
type: Class
subclass of: Type
comment: Categorization of a Family.
label: Familienkategorie @de
label: Tipo de familia @es
label: Type de famille @fr
change note: Added a new rdfs:label in German.
  date: 2025-04-08
change note: Aligned with RiC-CM 1.0: updated the skos:scopeNote.
  date: 2023-11-12
change note: Added a new rdfs:label in Spanish.
  date: 2023-11-02
change note: Added a new rdfs:label in French.
  date: 2023-08-25
change note: Removed the 0.2 existing unnecessary restriction.
  date: 2023-04-19
change note: Comment: slighty changed.
  date: 2020-10-23
scope note: Encompasses a wide variety of familial groups related by consanguinity, affinity, cohabitation, or other social conventions.
RiC-CM corresponding component: Corresponds to RiC-A20 (Family Type attribute)

Functional Equivalence Relation
type: Class
equivalent class: Restriction
  on property: has the role of the Functional Equivalence Relation
  has self: true
subclass of: Instantiation to Instantiation Relation
subclass of: Restriction
  on property: relation connects
  min qualified cardinality: 2
  on class: Instantiation
comment: Connects at least two Instantiations which may be considered as equivalent. This Relation is not oriented.
label: Relación de equivalencia funcional @es
label: Relation d’équivalence fonctionnelle @fr
label: Repräsentation-Äquivalent-Repräsentation @de
change note: Added a new rdfs:label in German.
  date: 2025-04-08
change note: Improved the description of the Relation class (rdfs:comment) by clearly specifying how it is directed.
  date: 2023-12-06
change note: Aligned with RiC-CM 1.0: updated the skos:scopeNote.
  date: 2023-11-12
change note: In order to get a system of rolified Relation classes: added an equivalentClass object property; replaced the specific object properties by the generic ones in the subClassOf declarations.
  date: 2023-11-08
change note: Added a new rdfs:label in Spanish.
  date: 2023-11-02
change note: Added a new rdfs:label in French.
  date: 2023-08-25
scope note: Two instantiations, from some point of view, may be considered as equivalent. This equivalence is usually based upon the fact that the instantiations have at least the same intellectual content (they instantiate the same record resource).
RiC-CM corresponding component: Class implementation of RiC-R035 and RiC-R035i relations

Group
type: Class
subclass of: Agent
disjoint with: Mechanism
disjoint with: Person
disjoint with: Position
comment: Two or more Agents that act together as an Agent.
label: Groupe d’agents @fr
label: Grupo de agentes @es
label: Gruppe @de
change note: Added a new rdfs:label in German.
  date: 2025-04-08
change note: Added a new rdfs:label in Spanish.
  date: 2023-11-02
change note: Added a new rdfs:label in French.
  date: 2023-08-25
change note: Scope note: made separate paragraphs plus very few changes. Disjoint with: enriched.
  date: 2020-10-23
scope note: Group is a kind of Agent. A Group has a socially recognized identity. Each member of the Group plays a particular role or roles (that is has a particular Position) in the coordinated activity of the Group. Corporate bodies and families are kinds of groups, though other kinds of groups are possible. For example, the “electorate” -- all of the voters in a given election. Complex, large groups may be subdivided into other groups.
RiC-CM corresponding component: Corresponds to RiC-E09 (Group Entity)

Group Subdivision Relation
type: Class
equivalent class: Restriction
  on property: has the role of the Group Subdivision Relation
  has self: true
subclass of: Agent Hierarchical Relation
subclass of: Whole Part Relation
subclass of: Restriction
  on property: relation has source
  qualified cardinality: 1
  on class: Group
subclass of: Restriction
  on property: relation has target
  min qualified cardinality: 1
  on class: Group
comment: Connects a Group and at least another Group, when the first one has or had the second one(s) among its subdivisions. The Relation is oriented from the Group to its subdivision(s): the parent Group is the source and the subdivision Group(s) is the target.
label: Gruppe-Untergruppe @de
label: Relación de subdivisión entre grupos de agentes @es
label: Relation de subdivision entre groupes d’agents @fr
change note: Added a new rdfs:label in German.
  date: 2025-04-08
change note: Improved the description of the Relation class (rdfs:comment) by clearly specifying how it is directed.
  date: 2023-12-06
change note: Aligned with RiC-CM 1.0: updated the description (rdfs:comment).
  date: 2023-11-12
change note: In order to get a system of rolified Relation classes: added an equivalentClass object property; replaced the specific object properties by the generic ones in the subClassOf declarations.
  date: 2023-11-08
change note: Added a new rdfs:label in Spanish.
  date: 2023-11-02
change note: Added a new rdfs:label in French.
  date: 2023-08-25
RiC-CM corresponding component: Class implementation of RiC-R005 and RiC-R005i relations

Identifier
type: Class
subclass of: Appellation
comment: A word, number, letter, symbol, or any combination of these used to uniquely identify or reference an individual instance of an entity within a specific information domain.
label: Identifiant @fr
label: Identificador @es
label: Identifikator @de
change note: Added a new rdfs:label in German.
  date: 2025-04-08
change note: Aligned with RiC-CM 1.0: updated the skos:scopeNote.
  date: 2023-11-12
change note: Added a new rdfs:label in Spanish.
  date: 2023-11-02
change note: Added a new rdfs:label in French.
  date: 2023-08-25
change note: Removed the 0.2 existing unnecessary restriction.
  date: 2023-04-19
scope note: Can include Global Persistent Identifiers (globally unique and persistently resolvable identifier for the entity) and/or Local Identifiers. Both the domain within which the identifier is unique, and the rules used in forming the identifier value should be provided with the identifier value.
RiC-CM corresponding component: Class implementation of RiC-A22 (Identifier attribute) (see also the identifier datatype property)

Identifier Type
type: Class
subclass of: Type
comment: Categorization of an Identifier.
label: Identifikatorenkategorie @de
label: Tipo de identificador @es
label: Type d’identifiant @fr
change note: Added a new rdfs:label in German.
  date: 2025-04-08
change note: Added a new rdfs:label in Spanish.
  date: 2023-11-02
change note: Added a new rdfs:label in French.
  date: 2023-08-25
change note: Removed the 0.2 existing unnecessary restriction.
  date: 2023-04-19
change note: Class added along with hasIdentifierType and isIdentifierTypeOf object properties.
  date: 2020-10-19
scope note: For example, 'old identifier' ; 'ISNI' (for a person or corporate body), etc.

Instantiation
type: Class
subclass of: Thing
comment: The inscription of information made by an Agent on a physical carrier in any persistent, recoverable form as a means of communicating information through time and space.
label: Instanciación @es
label: Instanciation @fr
label: Repräsentation oder Instanz @de
change note: Added a new rdfs:label in German.
  date: 2025-04-08
change note: Added a new rdfs:label in Spanish.
  date: 2023-11-02
change note: Added a new rdfs:label in French.
  date: 2023-08-25
change note: Removed the 0.2 existing unnecessary restrictions.
  date: 2023-04-19
change note: Comment: updated. Scope note: updated and made several paragraphs. Objective: to make RiC-O compliant with RiC-CM v0.2.
  date: 2020-10-23
scope note: A Record or Record Part must have been instantiated at least once, though this instantiation may no longer exist at the moment of description. An instantiation might also exist at the moment of description, but be destroyed at a later moment in time, when, for example, a derived instantiation might become the only remaining instantiation. A Record Set may have an instantiation, which is to say that it is not a necessary condition. An Instantiation may be derived from another Instantiation. A Record Resource may have many Instantiations simultaneously (for instance, a record printed and saved in the same time as DOCX and PDF/A would have 3 concurrent instantiations) or through time (for example, copy of a record). Depending on the context, a new instantiation may be seen as a new or as the same record resource. During in the process of re-instantiation something is lost and something is preserved, but it is up to the context and the Agent that produces or uses that Instantiation to assess whether the two instantiations are functionally equivalent or not. For instance, a postcard representing a town map from 1874 (Instantiation 1) is digitized and kept as a JPEG file (Instantiation 2). The digital copy may be considered as instantiating the "same" Record by an Agent considering the information transmitted by the Record (e.g., the urban landscape displayed), but as a" different" Record by an antiquarian more focused on the materiality of the carrier. Successive instantiations may change the perceivable boundaries of a Record Resource. For instance, a case file comprising many records may be digitized and saved as one single PDF file, which, from management perspective, may be treated as one Record. Similarly, a large Record Set (a fonds or a series) may be maintained as one database. On the other hand, one record (main document and its annexes) may be digitized in separate files and each one may be managed as a discrete “physical” item. Instantiations may require media…
RiC-CM corresponding component: Corresponds to RiC-E06 (Instantiation entity)
close to: PREMIS Representation

Instantiation Extent
type: Class
subclass of: Extent
comment: Countable characteristics of an Instantiation expressed as a quantity.
label: Extensión de la instanciación @es
label: Mesure d’une instanciation @fr
label: Umfang der Instanz|Repräsentation @de
change note: Added a new rdfs:label in German.
  date: 2025-04-08
change note: Aligned with RiC-CM 1.0: updated the description (rdfs:comment).
  date: 2023-11-12
change note: Added a new rdfs:label in Spanish.
  date: 2023-11-02
change note: Added a new rdfs:label in French.
  date: 2023-08-25
change note: Changed a bit the definition and added change notes.
  date: 2020-11-21
change note: Class added in order to handle an accurate description of an instantiation extent
  date: 2020-10-28
RiC-CM corresponding component: Class implementation of RiC-A23 (Instantiation Extent attribute)

Instantiation to Instantiation Relation
type: Class
equivalent class: Restriction
  on property: has the role of the Instantiation to Instantiation Relation
  has self: true
subclass of: Relation
subclass of: Restriction
  on property: relation connects
  min qualified cardinality: 2
  on class: Instantiation
comment: Connects at least two instantiations. This Relation is a generic, not oriented one.
label: Instanz|Repräsentation-Instanz|Repräsentation @de
label: Relación entre instanciaciones @es
label: Relation entre instanciations @fr
change note: Added a new rdfs:label in German.
  date: 2025-04-08
change note: Improved the description of the Relation class (rdfs:comment) by clearly specifying how it is directed.
  date: 2023-12-06
change note: In order to get a system of rolified Relation classes: added an equivalentClass object property; replaced the specific object properties by the generic ones in the subClassOf declarations.
  date: 2023-11-08
change note: Added a new rdfs:label in Spanish.
  date: 2023-11-02
change note: Added a new rdfs:label in French.
  date: 2023-08-25

Intellectual Property Rights Relation
type: Class
equivalent class: Restriction
  on property: has the role of the Intellectual Property Rights Relation
  has self: true
subclass of: Authority Relation
subclass of: Restriction
  on property: relation has source
  min qualified cardinality: 1
  on class: Class
    union of: Group
    union of: Person
    union of: Position
subclass of: Restriction
  on property: relation has target
  min qualified cardinality: 1
  on class: Class
    union of: Instantiation
    union of: Record Resource
comment: Connects at least one Agent and one Record Resource or Instantiation on which the Agent has or had some intellectual property rights. The Agent(s) is the source of the Relation and the Record Resource(s) or Instantiation(s) is the target.
label: Akteur-Urheberschaft-Recordressource/Instanz @de
label: Relación de propiedad intelectual @es
label: Relation de propriété intellectuelle @fr
change note: Added a new rdfs:label in German.
  date: 2025-04-08
change note: Improved the description of the Relation class (rdfs:comment) by clearly specifying how it is directed.
  date: 2023-12-06
change note: Aligned with RiC-CM 1.0: updated the description (rdfs:comment).
  date: 2023-11-12
change note: In order to get a system of rolified Relation classes: added an equivalentClass object property; replaced the specific object properties by the generic ones in the subClassOf declarations.
  date: 2023-11-08
change note: Added a new rdfs:label in Spanish.
  date: 2023-11-02
change note: Added a new rdfs:label in French.
  date: 2023-08-25
scope note: Can be used, when the record resource is a work, for specifying the connection between the record resource and its author(s).
RiC-CM corresponding component: Class implementation of RiC-R040 and RiC-R040i relations

Knowing Of Relation
type: Class
equivalent class: Restriction
  on property: has the role of the Knowing Of Relation
  has self: true
subclass of: Agent Relation
subclass of: Restriction
  on property: relation has source
  min qualified cardinality: 1
  on class: Person
subclass of: Restriction
  on property: relation has target
  min qualified cardinality: 1
  on class: Person
comment: Connects at least one Person to at least another one, when the first one has some knowledge of the second one through time or space. The first Person is the source of the Relation, and the second one is the target.
label: Person-Kenntnis-Person @de
label: Relación de conocimieto indirecto entre personas @es
label: Relation de connaissance à propos d’une personne @fr
change note: Added a new rdfs:label in German.
  date: 2025-04-08
change note: Improved the description of the Relation class (rdfs:comment) by clearly specifying how it is directed.
  date: 2023-12-06
change note: In order to get a system of rolified Relation classes: added an equivalentClass object property; replaced the specific object properties by the generic ones in the subClassOf declarations.
  date: 2023-11-08
change note: Added a new rdfs:label in Spanish.
  date: 2023-11-02
change note: Added a new rdfs:label in French.
  date: 2023-08-25
RiC-CM corresponding component: Class implementation of RiC-R050 and RiC-R050i relations

Knowing Relation
type: Class
equivalent class: Restriction
  on property: has the role of the Knowing Relation
  has self: true
subclass of: Agent Relation
subclass of: Restriction
  on property: relation connects
  min qualified cardinality: 2
  on class: Person
comment: Connects at least two Persons who directly know each other during their existence. This Relation is not oriented.
label: Person-Bekanntschaft-Person @de
label: Relación de conocimiento directo entre personas @es
label: Relation de connaissance entre personnes @fr
change note: Added a new rdfs:label in German.
  date: 2025-04-08
change note: Improved the description of the Relation class (rdfs:comment) by clearly specifying how it is directed.
  date: 2023-12-06
change note: Aligned with RiC-CM 1.0: updated the description (rdfs:comment), skos:scopeNote.
  date: 2023-11-12
change note: In order to get a system of rolified Relation classes: added an equivalentClass object property; replaced the specific object properties by the generic ones in the subClassOf declarations.
  date: 2023-11-08
change note: Added a new rdfs:label in Spanish.
  date: 2023-11-02
change note: Added a new rdfs:label in French.
  date: 2023-08-25
scope note: The relation implies that the two persons met or at least corresponded with each other.
RiC-CM corresponding component: Class implementation of RiC-R051 and RiC—R051i relations

Language
type: Class
subclass of: Concept
comment: A spoken or written human language represented in a Record Resource or used by an Agent.
label: Langue @fr
label: Lengua @es
label: Sprache @de
change note: Added a new rdfs:label in German.
  date: 2025-04-08
change note: Aligned with RiC-CM 1.0: updated the description (rdfs:comment).
  date: 2023-11-12
change note: Added a new rdfs:label in Spanish.
  date: 2023-11-02
change note: Added a new rdfs:label in French.
  date: 2023-08-25
change note: Changed the definition (skos:comment annotation); so that it conforms to the RiC-CM one.
  date: 2020-12-28
change note: Scope note from RiC-CM : deleted.
  date: 2020-10-23
RiC-CM corresponding component: Corresponds to RiC-A25 (Language attribute)

Leadership Relation
type: Class
equivalent class: Restriction
  on property: has the role of the Leadership Relation
  has self: true
subclass of: Agent Control Relation
subclass of: Restriction
  on property: leadership with position
  max qualified cardinality: 1
  on class: Position
subclass of: Restriction
  on property: relation has source
  min qualified cardinality: 1
  on class: Person
subclass of: Restriction
  on property: relation has target
  min qualified cardinality: 1
  on class: Group
comment: Connects at least one Person and at least one Group, when the first one(s) lead(s) or led the second one(s). The Relation is oriented from the leading Person to the Group: the leading Person(s) is the source of the Relation, and the Group(s) is the target.
label: Person-Führung-Person @de
label: Relación de liderazgo @es
label: Relation de direction @fr
change note: Added a new rdfs:label in German.
  date: 2025-04-08
change note: Improved the description of the Relation class (rdfs:comment) by clearly specifying how it is directed.
  date: 2023-12-06
change note: Aligned with RiC-CM 1.0: updated the description (rdfs:comment).
  date: 2023-11-12
change note: In order to get a system of rolified Relation classes: added an equivalentClass object property; replaced the specific object properties by the generic ones in the subClassOf declarations.
  date: 2023-11-08
change note: Added a new rdfs:label in Spanish.
  date: 2023-11-02
change note: Added a new rdfs:label in French.
  date: 2023-08-25
RiC-CM corresponding component: Class implementation of RiC-R042 and RiC-R042i relations

Legal Status
type: Class
subclass of: Type
comment: A status defined by law.
label: Rechtstatus @de
label: Status jurídico @es
label: Statut légal @fr
change note: Added a new rdfs:label in German.
  date: 2025-04-08
change note: Added a new rdfs:label in Spanish.
  date: 2023-11-02
change note: Added a new rdfs:label in French.
  date: 2023-08-25
RiC-CM corresponding component: Corresponds to RiC-A26 (Legal Status attribute)

Management Relation
type: Class
equivalent class: Restriction
  on property: has the role of the Management Relation
  has self: true
subclass of: Authority Relation
subclass of: Restriction
  on property: relation has source
  min qualified cardinality: 1
  on class: Agent
subclass of: Restriction
  on property: relation has target
  min qualified cardinality: 1
  on class: Class
    union of: Instantiation
    union of: Record Resource
comment: Connects at least one Agent and at least one Record Resource or Instantiation that the Agent manages or managed. The Agent(s) is the source of the Relation, and the Record Resource(s) or Instantiation(s) is the target.
label: Akteur-Management-Recordressource/Instanz @de
label: Relación de gestión @es
label: Relation de gestion @fr
change note: Added a new rdfs:label in German.
  date: 2025-04-08
change note: Improved the description of the Relation class (rdfs:comment) by clearly specifying how it is directed.
  date: 2023-12-06
change note: Aligned with RiC-CM 1.0: updated the description (rdfs:comment).
  date: 2023-11-12
change note: In order to get a system of rolified Relation classes: added an equivalentClass object property; replaced the specific object properties by the generic ones in the subClassOf declarations.
  date: 2023-11-08
change note: Added a new rdfs:label in Spanish.
  date: 2023-11-02
change note: Added a new rdfs:label in French.
  date: 2023-08-25
RiC-CM corresponding component: Class implementation of RiC-R038 and RiC-R038i relations

Mandate
type: Class
subclass of: Rule
comment: Delegation of responsibility or authority by an Agent to another Agent to perform an Activity.
label: Mandat @de
label: Norma @es
change note: Added a new rdfs:label in German.
  date: 2025-04-08
change note: Aligned with RiC-CM 1.0: updated the description (rdfs:comment), skos:scopeNote.
  date: 2023-11-12
change note: Added a new rdfs:label in Spanish.
  date: 2023-11-02
change note: Added a new rdfs:label in French.
  date: 2023-08-25
change note: Removed the 0.2 existing unnecessary restriction.
  date: 2023-04-21
change note: Scope note: made separate paragraphs and updated. Objective: to make RiC-O compliant with RiC-CM v0.2.
  date: 2020-10-23
scope note: Mandate is a kind of Rule. A mandate confers the responsibility or authority of an agent to perform a specified activity. In addition to assigning an activity and delegating responsibility or authority to perform the activity to an agent, a mandate commonly limits the place (jurisdiction) and date (time period) within which an agent may perform the activity (where and when). Mandates exist in a specific social and cultural context, and within that context are subject to change over time. While a mandate may be tacit, in whole or part, it may be explicitly expressed in a variety of documentary sources (for example, constitutions, legislation, (legal) acts, statutes, legal codes, ordinances, charges, charters, or mission statements). The evidence for identifying a mandate may be found in its entirety in one documentary source (for example, a law or regulation), or may be found in two or more sources. A mandate should not be confused with the one or more documentary sources that serve as evidence of its identity. A documentary source is a record.
RiC-CM corresponding component: Corresponds to RiC-E17 (Mandate entity)

Mandate Relation
type: Class
equivalent class: Restriction
  on property: has the role of the Mandate Relation
  has self: true
subclass of: Rule Relation
subclass of: Restriction
  on property: as concerns activity
  min qualified cardinality: 1
  on class: Activity
subclass of: Restriction
  on property: relation has source
  min qualified cardinality: 1
  on class: Mandate
subclass of: Restriction
  on property: relation has target
  min qualified cardinality: 1
  on class: Agent
comment: Connects at least one Mandate and at least one Agent, when the first gives or gave the second one the authority or competencies to act. May also involve one to many Activities that the Mandate(s) assign(s) or assigned to the Agent(s). The Mandate(s) is the source of the Relation and the Agent(s) is the target.
label: Mandat-Akteur @de
label: Relación normativa @es
label: Relation impliquant un mandat @fr
change note: Added a new rdfs:label in German.
  date: 2025-04-08
change note: Improved the description of the Relation class (rdfs:comment) by clearly specifying how it is directed.
  date: 2023-12-06
change note: Aligned with RiC-CM 1.0: updated the description (rdfs:comment).
  date: 2023-11-12
change note: In order to get a system of rolified Relation classes: added an equivalentClass object property; replaced the specific object properties by the generic ones in the subClassOf declarations.
  date: 2023-11-08
change note: Added a new rdfs:label in Spanish.
  date: 2023-11-02
change note: Added a new rdfs:label in French.
  date: 2023-08-25
change note: Removed a 0.2 existing unnecessary restriction.
  date: 2023-04-19
RiC-CM corresponding component: Class implementation of RiC-R067 and RiC-R067i relations

Mandate Type
type: Class
subclass of: Rule Type
comment: Categorization of a Mandate.
label: Mandatkategorie @de
label: Tipo de norma @es
label: Type de mandat @fr
change note: Added a new rdfs:label in German.
  date: 2025-04-08
change note: Added in RiC-0 1.0 as it has been added to RiC-CM 1.0.
  date: 2023-11-12
scope note: For example : charter, treaty, contract, letter of appointment, papal mandate, episcopal mandate, ciurt mandate, election mandate, popular mandate, federal mandate, etc.
RiC-CM corresponding component: Corresponds to RiC-A44 (Mandate Type attribute).

Mechanism
type: Class
subclass of: Agent
disjoint with: Person
disjoint with: Position
comment: A process or system created by a Person or Group that performs an Activity.
label: Mecanismo @es
label: Mechanismus @de
label: Système @fr
change note: Added a new rdfs:label in German.
  date: 2025-04-08
change note: Aligned with RiC-CM 1.0: updated the skos:scopeNote.
  date: 2023-11-12
change note: Added a new rdfs:label in Spanish.
  date: 2023-11-02
change note: Added a new rdfs:label in French.
  date: 2023-08-25
change note: scope note: made separate paragraphs. Disjoint with: enriched.
  date: 2020-10-23
scope note: Mechanism is a kind of Agent. A mechanism may have both mechanical and software components or may be exclusively software. A mechanism acts in the world producing physical or social effects and may generate or modify records. A mechanism performs activities based on rules determined by the agent that designed and created it. A mechanism has an essential, derivative relation with the designing and creating agent.
RiC-CM corresponding component: Corresponds to RiC-E13 (Mechanism entity)

Membership Relation
type: Class
equivalent class: Restriction
  on property: has the role of the Membership Relation
  has self: true
subclass of: Agent Relation
subclass of: Restriction
  on property: membership with position
  max qualified cardinality: 1
  on class: Position
subclass of: Restriction
  on property: relation has source
  qualified cardinality: 1
  on class: Group
subclass of: Restriction
  on property: relation has target
  min qualified cardinality: 1
  on class: Person
comment: Connects a Group and at least one Person, when the first one has or had the second one(s) among its members. The Relation is oriented from the Group to its members: the Group(s) is the source of the Relation, and the Person(s) is the target.
label: Gruppe-Mitgliedschaft-Person @de
label: Relación de membresía @es
label: Relation d’appartenance @fr
change note: Added a new rdfs:label in German.
  date: 2025-04-08
change note: Improved the description of the Relation class (rdfs:comment) by clearly specifying how it is directed.
  date: 2023-12-06
change note: Aligned with RiC-CM 1.0: updated the description (rdfs:comment).
  date: 2023-11-12
change note: In order to get a system of rolified Relation classes: added an equivalentClass object property; replaced the specific object properties by the generic ones in the subClassOf declarations.
  date: 2023-11-08
change note: Added a new rdfs:label in Spanish.
  date: 2023-11-02
change note: Added a new rdfs:label in French.
  date: 2023-08-25
RiC-CM corresponding component: Class implementation of RiC-R055 and RiC-R055i relations

Migration Relation
type: Class
equivalent class: Restriction
  on property: has the role of the Migration Relation
  has self: true
subclass of: Derivation Relation
subclass of: Restriction
  on property: relation has source
  qualified cardinality: 1
  on class: Instantiation
subclass of: Restriction
  on property: relation has target
  min qualified cardinality: 1
  on class: Instantiation
comment: Connects an Instantiation and at least another Instantiation it has been migrated into. The Relation is oriented chronologically, from the first Instantiation in time (the migrated one) to the one which results from its migration: the first Instantiation in time is the source of the Relation, and the resulting Instantiation is the target.
label: Relación de migración entre instanciaciones @es
label: Relation de migration @fr
label: Repräsentation-Migration-Repräsentation @de
change note: Added a new rdfs:label in German.
  date: 2025-04-08
change note: Improved the description of the Relation class (rdfs:comment) by clearly specifying how it is directed.
  date: 2023-12-06
change note: Aligned with RiC-CM 1.0: updated the description (rdfs:comment), skos:scopeNote.
  date: 2023-11-12
change note: In order to get a system of rolified Relation classes: added an equivalentClass object property; replaced the specific object properties by the generic ones in the subClassOf declarations.
  date: 2023-11-08
change note: Added a new rdfs:label in Spanish.
  date: 2023-11-02
change note: Added a new rdfs:label in French.
  date: 2023-08-25
scope note: Use for digital instantiations.
RiC-CM corresponding component: Class implementation of RiC-R015 and RiC-R015i relations

Name
type: Class
subclass of: Appellation
comment: A label, title or term designating an entity in order to make it distinguishable from other similar entities.
label: Nom @fr
label: Nombre @es
change note: Added a new rdfs:label in German.
  date: 2025-04-08
change note: Aligned with RiC-CM 1.0: updated the description (rdfs:comment), skos:scopeNote.
  date: 2023-11-12
change note: Added a new rdfs:label in Spanish.
  date: 2023-11-02
change note: Added a new rdfs:label in French.
  date: 2023-08-25
scope note: Provides brief information about the content or other individual characteristics of the entity being described, necessary to distinguish it from other perhaps similar entities.
RiC-CM corresponding component: Class implementation of RiC-A28 (Name attribute) (see also the name datatype property)

Occupation Type
type: Class
subclass of: Activity Type
subclass of: Demographic Group
comment: Categorization of a profession, trade, or craft pursued by a Person in fulfilment of an Activity.
label: Beschäftigungskategorie @de
label: Tipo de ocupación @es
label: Type d’occupation @fr
change note: Added a new rdfs:label in German.
  date: 2025-04-08
change note: Aligned with RiC-CM 1.0: updated the description (rdfs:comment), skos:scopeNote.
  date: 2023-11-12
change note: Added a new rdfs:label in Spanish.
  date: 2023-11-02
change note: Added a new rdfs:label in French.
  date: 2023-08-25
change note: Removed the 0.2 existing unnecessary restriction.
  date: 2023-04-19
change note: scope note: added.
  date: 2020-10-23
scope note: The pursuit of an occupation involves the performance of an Activity. Successful performance of the Activity is based on the ability to perform related competencies successfully. Such competencies may be acquired through education or experience, or a combination of both. The authority of the Person to pursue the occupation may be derived tacitly or explicitly from an external Agent, based on a demonstrated mastery of the competency. An occupation may be pursued independently by a Person or a Group, thereby contributing to the fulfilment of the function (activity) of the group. Should not be confused with Position where, for example, an agent with the occupation type "lawyer" holds the position of "legal counsel" in an agency. Related to but should not be confused with the domain or field of activity, such as an archivist who works in the domain of archival science.
RiC-CM corresponding component: Corresponds to RiC-A30 (Occupation Type attribute)

Organic or functional provenance Relation
type: Class
equivalent class: Restriction
  on property: has the role of the Organic or functional provenance Relation
  has self: true
subclass of: Relation
subclass of: Restriction
  on property: relation has source
  min qualified cardinality: 1
  on class: Class
    union of: Instantiation
    union of: Record Resource
subclass of: Restriction
  on property: relation has target
  min qualified cardinality: 1
  on class: Class
    union of: Activity
    union of: Agent
comment: Connects at least one Record Resource or Instantiation to at least one Agent or Activity, when the Agent or Activity is the provenance of the Record Resource or Instantiation (i.e. when the Agent created, accumulated or maintained the Record Resource or Instantiation, or when the Activity resulted into them). The Record Resource(s) or Instantiation(s) is the source of the Relation, and the Agent(s) or Activity(-ies) is the target.
label: Recordressource/Instanz-Herkunft-Akteur/Funktion @de
label: Relación de procedencia orgánica or funcional @es
label: Relation de provenance organique ou fonctionnelle @fr
change note: Added a new rdfs:label in German.
  date: 2025-04-08
change note: Improved the description of the Relation class (rdfs:comment) by clearly specifying how it is directed.
  date: 2023-12-06
change note: In order to get a system of rolified Relation classes: added an equivalentClass object property; replaced the specific object properties by the generic ones in the subClassOf declarations.
  date: 2023-11-08
change note: Renamed the relation (its name was ProvenanceRelation).
  date: 2023-11-07
change note: Added a new rdfs:label in Spanish.
  date: 2023-11-02
change note: Added a new rdfs:label in French.
  date: 2023-08-25
scope note: This relation stands for organic and for functional provenance.

Organic Provenance Relation
type: Class
equivalent class: Restriction
  on property: has the role of the Organic Provenance Relation
  has self: true
subclass of: Organic or functional provenance Relation
subclass of: Restriction
  on property: relation has source
  min qualified cardinality: 1
  on class: Class
    union of: Instantiation
    union of: Record Resource
subclass of: Restriction
  on property: relation has target
  min qualified cardinality: 1
  on class: Agent
comment: Connects at least one Record Resource or an Instantiation to at least one Agent that creates or accumulates the Record Resource, receives it, or sends it. The Record Resource(s) or Instantiation(s) is the source of the Relation, and the Agent(s) is the target.
label: Recordressource/Instanz-Herkunft-Akteur @de
label: Relación de procedencia orgánica @es
label: Relation de provenance organique @fr
change note: Added a new rdfs:label in German.
  date: 2025-04-08
change note: Improved the description of the Relation class (rdfs:comment) by clearly specifying how it is directed.
  date: 2023-12-06
change note: Aligned with RiC-CM 1.0: updated the description (rdfs:comment), skos:scopeNote.
  date: 2023-11-12
change note: In order to get a system of rolified Relation classes: added an equivalentClass object property; replaced the specific object properties by the generic ones in the subClassOf declarations.
  date: 2023-11-08
change note: Renamed the relation in order to make it clearer (its name was AgentOriginationRelation).
  date: 2023-11-07
change note: Added a new rdfs:label in Spanish.
  date: 2023-11-02
change note: Added a new rdfs:label in French.
  date: 2023-08-25
scope note: This is the most general organic provenance relation. Use it to connect a record resource or instantiation with an agent only if it is not possible to use a narrower, more specific relation, for example Creation Relation.
RiC-CM corresponding component: Class implementation of RiC-R026 and RiC-R026i relations

Ownership Relation
type: Class
equivalent class: Restriction
  on property: has the role of the Ownership Relation
  has self: true
subclass of: Authority Relation
subclass of: Restriction
  on property: relation has source
  min qualified cardinality: 1
  on class: Class
    union of: Group
    union of: Person
    union of: Position
subclass of: Restriction
  on property: relation has target
  min qualified cardinality: 1
  on class: Thing
comment: Connects at least one Group, Person or Position and at least a Thing that these Agent(s) own(s) or owned. The Group(s), Person(s) or Position(s) is the source of the Relation, and the Agent(s) is the target.
label: Gruppe/Person/Position-Besitz-Ding @de
label: Relación de posesión @es
label: Relation de propriété @fr
change note: Added a new rdfs:label in German.
  date: 2025-04-08
change note: Improved the description of the Relation class (rdfs:comment) by clearly specifying how it is directed.
  date: 2023-12-06
change note: Aligned with RiC-CM 1.0: updated the description (rdfs:comment), skos:scopeNote.
  date: 2023-11-12
change note: In order to get a system of rolified Relation classes: added an equivalentClass object property; replaced the specific object properties by the generic ones in the subClassOf declarations.
  date: 2023-11-08
change note: Added a new rdfs:label in Spanish.
  date: 2023-11-02
change note: Added a new rdfs:label in French.
  date: 2023-08-25
scope note: Among other probably more rare use cases for archival description, can be used between agents (a person owns a corporate body, a corporate body owns a mechanism), or between agents and record resources.
RiC-CM corresponding component: Class implementation of RiC-R037 and RiC-R037i relations

Performance Relation
type: Class
equivalent class: Restriction
  on property: has the role of the Performance Relation
  has self: true
subclass of: Event Relation
subclass of: Restriction
  on property: relation has source
  min qualified cardinality: 1
  on class: Activity
subclass of: Restriction
  on property: relation has target
  min qualified cardinality: 1
  on class: Agent
comment: Connects at least one Activity to at least one Agent that performs or performed the activity. The Activity(-ies) is the source of the Relation and the Agent(s) is the target.
label: Aktivität-Ausführung-Akteur @de
label: Relación de desarrollo funcional @es
label: Relation entre activités et agents @fr
change note: Added a new rdfs:label in German.
  date: 2025-04-08
change note: Improved the description of the Relation class (rdfs:comment) by clearly specifying how it is directed.
  date: 2023-12-06
change note: Aligned with RiC-CM 1.0: updated the description (rdfs:comment).
  date: 2023-11-12
change note: In order to get a system of rolified Relation classes: added an equivalentClass object property; replaced the specific object properties by the generic ones in the subClassOf declarations.
  date: 2023-11-08
change note: Added a new rdfs:label in Spanish.
  date: 2023-11-02
change note: Added a new rdfs:label in French.
  date: 2023-08-25
RiC-CM corresponding component: Class implementation of RiC-R060 and RiC-R060i relations

Person
type: Class
subclass of: Agent
disjoint with: Position
comment: An individual human being.
label: Persona @es
label: Personne @fr
change note: Added a new rdfs:label in German.
  date: 2025-04-08
change note: Aligned with RiC-CM 1.0: updated the description (rdfs:comment), skos:scopeNote.
  date: 2023-11-12
change note: Added a new rdfs:label in Spanish.
  date: 2023-11-02
change note: Added a new rdfs:label in French.
  date: 2023-08-25
change note: Removed the 0.2 existing unnecessary restriction.
  date: 2023-04-19
change note: Removed one Restriction.
  date: 2021-02-08
change note: Scope note: made separate paragraphs and updated. Disjoint with: enriched. Objective: to make RiC-O compliant with RiC-CM v0.2.
  date: 2020-10-23
change note: Scope note: made separate paragraphs and updated. Disjoint with: enriched. Objective: to make RiC-O compliant with RiC-CM v0.2.
  date: 2020-10-23
scope note: Person is a kind of Agent. Most commonly, a human being (biological person) has a single socially constructed identity or persona. Less common though not rare, one or more personae in addition to the original persona which emerges at or near birth may be associated with the human being over the course of that human being’s lifetime. Such "alternative personae" are most often created by the original person for specific purposes. The original persona may, in everyday discourse, be regarded as “the real person”. Under some circumstances, an alternative persona might eclipse or replace the original person (Mark Twain eclipsing Samuel Clemens; John Wayne eclipsing Marion Mitchell Morrison), that is, the alternative identity becomes the predominant identity. Less common is when two or more persons collaborate to create a shared persona. A persona shared by two or more persons constitutes a kind of group. Within the archival context, the description of a person commonly will focus on the original associated persona, with alternative personae noted. Exceptionally, an alternative persona may displace the original persona as the focus of the description. Under some circumstances, for example, when record resources are associated with two or more different personae of one person, describing the different personae as separate though related persons may be desirable. Alternatively, a person may change their identity over the course of their lifetime.
RiC-CM corresponding component: Corresponds to RiC-E08 (Person entity)

Physical Location
type: Class
subclass of: Thing
comment: A delimitation of the physical territory of a Place.
label: Localisation physique @fr
label: Localización física de lugar @es
label: Standort @de
change note: Added a new rdfs:label in German.
  date: 2025-04-08
change note: Aligned with RiC-CM 1.0: updated the skos:scopeNote.
  date: 2023-11-12
change note: Added a new rdfs:label in Spanish.
  date: 2023-11-02
change note: Added a new rdfs:label in French.
  date: 2023-08-25
change note: Removed the two 0.2 existing unnecessary restrictions.
  date: 2023-04-19
scope note: Used to describe basic human-readable text such as an address, a cadastral reference, or less precise information found in a record. Use the coordinates datatype property, or the Coordinates class to capture the geographical coordinates of the Place. Use spatial relations (particularly 'has or had location') to capture a relation between two places.
RiC-CM corresponding component: Class implementation of RiC-A27 (Location attribute)

Place
type: Class
subclass of: Thing
comment: Bounded, named geographic area or region.
label: Geografikum @de
label: Lieu @fr
label: Lugar @es
change note: Added a new rdfs:label in German.
  date: 2025-04-08
change note: Aligned with RiC-CM 1.0: updated the skos:scopeNote.
  date: 2023-11-12
change note: Added a new rdfs:label in Spanish.
  date: 2023-11-02
change note: Added a new rdfs:label in French.
  date: 2023-08-25
change note: Removed the 0.2 existing unnecessary restriction.
  date: 2023-04-19
change note: Comment: updated. Scope note: updated and made several paragraphs. Objective: to make RiC-O compliant with RiC-CM v0.2.
  date: 2020-10-23
scope note: A jurisdiction is the bounded geographic area within which an Agent has the authority to perform specified activities constrained by rules. Jurisdictions, man-made structures, and natural features are historical entities. A Place thus may have a beginning date and ending date and changing boundaries that result from human or natural events. A Place may be systematically referenced to a location on the earth (geographic coordinates).
RiC-CM corresponding component: Corresponds to RiC-E22 (Place entity)

Place Name
type: Class
subclass of: Name
comment: A label, title or term designating a Place in order to make it distinguishable from other similar entities.
label: Geografikumsname @de
label: Nombre de lugar @es
label: Nom de lieu @fr
change note: Added a new rdfs:label in German.
  date: 2025-04-08
change note: Added a new rdfs:label in Spanish.
  date: 2023-11-02
change note: Added a new rdfs:label in French.
  date: 2023-08-25
RiC-CM corresponding component: Class implementation of a specialization of RiC-A28 (Name attribute)

Place Relation
type: Class
equivalent class: Restriction
  on property: has the role of the Place Relation
  has self: true
subclass of: Relation
subclass of: Restriction
  on property: relation has source
  qualified cardinality: 1
  on class: Place
subclass of: Restriction
  on property: relation has target
  min qualified cardinality: 1
  on class: Thing
comment: Connects a Place and at least one Thing when the first is associated with the existence and lifecycle of the second one. The Place is the source of the Relation and the Thing(s) is the target.
label: Geografikum-Ding @de
label: Relación con lugar @es
label: Relation impliquant un lieu @fr
change note: Added a new rdfs:label in German.
  date: 2025-04-08
change note: Improved the description of the Relation class (rdfs:comment) by clearly specifying how it is directed.
  date: 2023-12-06
change note: In order to get a system of rolified Relation classes: added an equivalentClass object property; replaced the specific object properties by the generic ones in the subClassOf declarations.
  date: 2023-11-08
change note: Added a new rdfs:label in Spanish.
  date: 2023-11-02
change note: Added a new rdfs:label in French.
  date: 2023-08-25
RiC-CM corresponding component: Class implementation of RiC-R074 and RiC-R074i relations

Place Type
type: Class
subclass of: Type
comment: Categorization of a Place.
label: Geografikumskategorie @de
label: Tipo de lugar @es
label: Type de lieu @fr
change note: Added a new rdfs:label in German.
  date: 2025-04-08
change note: Added a new rdfs:label in Spanish.
  date: 2023-11-02
change note: Added a new rdfs:label in French.
  date: 2023-08-25
change note: Removed the 0.2 existing unnecessary restriction.
  date: 2023-04-19
scope note: Broadly, a Place may be a member of three broad categories: jurisdiction, manmade structure, or a natural feature. Each of these three categories can subdivided into narrower categories.
RiC-CM corresponding component: Corresponds to RiC-A32 (Place Type attribute)

Position
type: Class
subclass of: Agent
comment: The functional role of a Person within a Group.
label: Poste occupé @fr
label: Puesto @es
change note: Added a new rdfs:label in German.
  date: 2025-04-08
change note: Added a new rdfs:label in Spanish.
  date: 2023-11-02
change note: Added a new rdfs:label in French.
  date: 2023-08-25
change note: Scope note: made separate paragraphs and updated. Disjoint with: enriched. Objective: to make RiC-O compliant with RiC-CM v0.2.
  date: 2020-10-23
scope note: Position is a kind of Agent. Position is the intersection of a Person and a Group. Position exists independently of the Person that holds the Position within a Group. More than one Person may hold a Position. Position is commonly defined in a Mandate, often called a position description or job description. The Mandate may specify the work to be performed (Activity) as well as the competencies for performing the Activity. A Position is often given a Name. A Position may be tied to a project or to a set of tasks and thus have a defined duration. A Position may change over time, as the Group that establishes it changes over time. Position is not to be confused with Occupation or Activity. Within the records created by a Corporate Body, a Position may be used to identify the record sets resulting from activities performed by one or more persons holding the Position over time, without necessarily identifying or describing the Person or persons, or identifying which records were created by each Person.
RiC-CM corresponding component: Corresponds to RiC-E12 (Position entity)

Position Holding Relation
type: Class
equivalent class: Restriction
  on property: has the role of the Position Holding Relation
  has self: true
subclass of: Agent Relation
subclass of: Restriction
  on property: relation has source
  min qualified cardinality: 1
  on class: Person
subclass of: Restriction
  on property: relation has target
  min qualified cardinality: 1
  on class: Position
comment: Connects at least one Person and at least one Position that the Person(s) occupies or occupied. The Person is the source of the Relation and the Position is the target.
label: Person-Position @de
label: Relación de ocupación entre una persona y un puesto @es
label: Relation entre une personne et un poste @fr
change note: Added a new rdfs:label in German.
  date: 2025-04-08
change note: Improved the description of the Relation class (rdfs:comment) by clearly specifying how it is directed.
  date: 2023-12-06
change note: Aligned with RiC-CM 1.0: updated the description (rdfs:comment).
  date: 2023-11-12
change note: In order to get a system of rolified Relation classes: added an equivalentClass object property; replaced the specific object properties by the generic ones in the subClassOf declarations.
  date: 2023-11-08
change note: Added a new rdfs:label in Spanish.
  date: 2023-11-02
change note: Added a new rdfs:label in French.
  date: 2023-08-25
RiC-CM corresponding component: Class implementation of RiC-R054 and RiC-R054i relations

Position to Group Relation
type: Class
equivalent class: Restriction
  on property: has the role of the Position to Group Relation
  has self: true
subclass of: Agent Relation
subclass of: Restriction
  on property: relation has source
  min qualified cardinality: 1
  on class: Position
subclass of: Restriction
  on property: relation has target
  qualified cardinality: 1
  on class: Group
comment: Connects at least one Position and a Group in which the position(s) exist(s) or existed, or that is (are) defined by that group's organizational structure. The Position(s) is the source of the Relation and the Group is the target.
label: Position-Gruppe @de
label: Relación de ocupación entre un grupo y un puesto @es
label: Relation entre un poste et un groupe @fr
change note: Added a new rdfs:label in German.
  date: 2025-04-08
change note: Improved the description of the Relation class (rdfs:comment) by clearly specifying how it is directed.
  date: 2023-12-06
change note: Aligned with RiC-CM 1.0: updated the description (rdfs:comment).
  date: 2023-11-12
change note: In order to get a system of rolified Relation classes: added an equivalentClass object property; replaced the specific object properties by the generic ones in the subClassOf declarations.
  date: 2023-11-08
change note: Added a new rdfs:label in Spanish.
  date: 2023-11-02
change note: Added a new rdfs:label in French.
  date: 2023-08-25
RiC-CM corresponding component: Class implementation of RiC-R056 and RiC-R056i relations

Production Technique Type
type: Class
subclass of: Type
comment: The method used in the representation of information on an instantiation.
label: Herstellungstechnikkategorie @de
label: Tipo de técnica de producción @es
label: Type de technique de production @fr
change note: Added a new rdfs:label in German.
  date: 2025-04-08
change note: Aligned with RiC-CM 1.0: updated the description (rdfs:comment).
  date: 2023-11-12
change note: Added a new rdfs:label in Spanish.
  date: 2023-11-02
change note: Added a new rdfs:label in French.
  date: 2023-08-25
change note: Removed the 0.2 existing unnecessary restriction.
  date: 2023-04-19
change note: Comment: updated. Objective: to make RiC-O compliant with RiC-CM v0.2.
  date: 2020-10-23
RiC-CM corresponding component: Class implementation of RiC-A33 (Production Technique attribute)

Proxy
type: Class
subclass of: Concept
subclass of: Restriction
  on property: proxy for
  qualified cardinality: 1
  on class: Record Resource
subclass of: Restriction
  on property: proxy in
  qualified cardinality: 1
  on class: Record Resource
comment: A Proxy represents (stands for) a Record Resource as it exists in a specific other Record Resource.
change note: Added a new rdfs:label in German.
  date: 2025-04-08
change note:
  date: 2025-03-04
  value: Changed range of proxyIn restriction and rdfs:comment to allow any Record Resource, not only a Record Set. Also tweaked the scope note to refer to the new datatype properties rico:rankInSequence and rico:rankInHierarchy, and to generalise it to different kinds of Record Resources.
change note: Added a new rdfs:label in Spanish.
  date: 2023-11-02
change note: Added a new rdfs:label in French.
  date: 2023-08-25
scope note: Useful e.g. in conjunction with rico:rankInSequence for describing sequences of Records or Record Sets in the context of a Record Set, or of Record Parts and Records in the context of a Record; or in conjunction with rico:rankInHierarchy for describing hierarchies of Records and/or Record Parts in the context of a Record Set, Record, or Record Part. A Record Resource has only one Proxy in the context of one specific Record Set, Record, or Record Part. It may have many Proxies simultaneously or through time.
close to: ORE Proxy (http://www.openarchives.org/ore/terms/Proxy)

Documento
type: Class
subclass of: Record Resource
comment: Discrete information content formed and inscribed, at least once, by any method on any carrier in any persistent, recoverable form by an Agent in the course of life or work activity.
label: Objet informationnel @fr
label: Record
change note: Added a new rdfs:label in German.
  date: 2025-04-08
change note: Aligned with RiC-CM 1.0: updated the description (rdfs:comment), skos:scopeNote.
  date: 2023-11-12
change note: Added a new rdfs:label in Spanish.
  date: 2023-11-02
change note: Added a new rdfs:label in French.
  date: 2023-08-25
change note: Removed the Restriction.
  date: 2021-02-08
change note: Scope note: updated and made several paragraphs. Objective: to make RiC-O compliant with RiC-CM v0.2.
  date: 2020-10-23
scope note: Record is a kind of Record Resource. A Record may itself contain one or more Records, or may consist of one or more Record Parts. A Record must have or have had at least one Instantiation. A Record may have more than one Instantiation. An Instantiation derived from another Instantiation of a Record may be considered the instantiation of the same Record or an instantiation of a new Record, depending on the context. A Record may serve a variety of purposes, though it always documents or is evidence of Activity.
RiC-CM corresponding component: Corresponds to RiC-E04 (Record entity)

Record Part
type: Class
subclass of: Record Resource
comment: Component of a Record with independent information content that contributes to the intellectual completeness of the Record.
label: Componente documental @es
label: Partie d’objet informationnel @fr
label: Recordteil @de
change note: Added a new rdfs:label in German.
  date: 2025-04-08
change note: Aligned with RiC-CM 1.0: updated the description (rdfs:comment).
  date: 2023-11-12
change note: Added a new rdfs:label in Spanish.
  date: 2023-11-02
change note: Added a new rdfs:label in French.
  date: 2023-08-25
change note: Removed the Restriction.
  date: 2021-02-08
change note: comment: updated. Scope note: made several paragraphs. Objective: to make RiC-O compliant with RiC-CM v0.2.
  date: 2020-10-23
scope note: Record Part is a kind of Record Resource. A Record Part may itself have Record Parts.
RiC-CM corresponding component: Corresponds to RiC-E05 (Record Part entity)

Record Resource
type: Class
subclass of: Thing
comment: Information produced or acquired and retained by an Agent in the course of life or work activity.
label: Recordressource @de
label: Recurso documental @es
label: Ressource archivistique @fr
change note: Added a new rdfs:label in German.
  date: 2025-04-08
change note: Aligned with RiC-CM 1.0: updated the description (rdfs:comment), skos:scopeNote.
  date: 2023-11-12
change note: Added a new rdfs:label in Spanish.
  date: 2023-11-02
change note: Added a new rdfs:label in French.
  date: 2023-08-25
change note: Removed the 0.2 existing unnecessary restriction.
  date: 2023-04-19
change note: Removed one Restriction.
  date: 2021-02-08
change note: Scope note: made separate paragraphs plus very few changes.
  date: 2020-10-23
scope note: Record resource is a kind of Thing. Producing a record resource may imply either its initial creation or a reuse of previous existing information by combination, rearrangement, selecting, reformatting, etc. Record set, record, and record part are kinds of record resource. A record resource is evidence of the activity of an agent. More than one agent may be involved in the creation of a record resource. The role of the agent in creating the record resource may take different forms, for example, authoring of an individual record, accumulating a record set, or arranging a record set. Though a record, record set, and record part, under most circumstances, may be easily distinguished from one another, identifying the boundary of each may frequently present particular challenges. Documentary forms provide the rules governing the structure of many types of records, providing criteria for identifying a record's boundary, and identifying its essential parts. Many records, though, do not have well-established documentary forms, particularly in the case of digital records, where it may be difficult to determine whether individual elements represented in separate bitstreams are record parts, records, or record sets. For example, is photographic information represented independently in a bitstream embedded in a text document a record or a record part? Or is the same photographic information attached to an email that maintains its independent representation, a record or a record part? Information grouped for some purpose, for example, ZIP or TAR "file compression" for saving storage space, presents a further challenge. One file comprises multiple bitstreams subjected to techniques that remove bits that can be losslessly recovered when decompressed. Under what circumstances is such a compressed bitstream a record or a record set? Determining when an information object is a record, record set, or record part is based on perspective and judgement exercised in a particular context. I…
RiC-CM corresponding component: Corresponds to RiC-E02 (Record Resource entity)

Record Resource Extent
type: Class
subclass of: Extent
comment: The quantity of information content, as human experienced, contained in a Record Resource.
label: Extensión de recurso documental @es
label: Mesure d’une ressource archivistique @fr
label: Recordressourceumfang @de
change note: Added a new rdfs:label in German.
  date: 2025-04-08
change note: Aligned with RiC-CM 1.0: updated the description (rdfs:comment), skos:scopeNote.
  date: 2023-11-12
change note: Added a new rdfs:label in Spanish.
  date: 2023-11-02
change note: Added a new rdfs:label in French.
  date: 2023-08-25
change note: Changed a bit the definition and added change notes.
  date: 2020-11-21
change note: Class added in order to handle an accurate description of a record resource extent
  date: 2020-10-28
scope note: The method and precision of expressing the quantity of information represented in a Record Resource will vary according to the kind of record resource being described, processing economy constraints, etc. For Record Sets, quantity may be expressed as number of records, or, for analogue records in particular, by the physical storage dimensions of the members of the Record Set. For individual Records or Record Parts, quantity may be expressed in more precise terms.
RiC-CM corresponding component: Class implementation of RiC-A35 (Record Resource extent attribute)

Record Resource Genetic Relation
type: Class
equivalent class: Restriction
  on property: has the role of the Record Resource Genetic Relation
  has self: true
subclass of: Record Resource to Record Resource Relation
subclass of: Restriction
  on property: relation connects
  min qualified cardinality: 2
  on class: Record Resource
comment: Connects two or more record resources when there is a genetic link between them. Genetic in this sense is as defined by diplomatics, i.e., the process by which a record resource is developed. This Relation is a generic, not oriented one.
label: Recordressource-Entstehungszusammenhang-Recordressource @de
label: Relación genética entre recursos documentales @es
label: Relation génétique entre des ressources archivistiques @fr
change note: Added a new rdfs:label in German.
  date: 2025-04-08
change note: Improved the description of the Relation class (rdfs:comment) by clearly specifying how it is directed.
  date: 2023-12-06
change note: Aligned with RiC-CM 1.0: updated the description (rdfs:comment).
  date: 2023-11-12
change note: In order to get a system of rolified Relation classes: added an equivalentClass object property; replaced the specific object properties by the generic ones in the subClassOf declarations.
  date: 2023-11-08
change note: Added a new rdfs:label in Spanish.
  date: 2023-11-02
change note: Added a new rdfs:label in French.
  date: 2023-08-25
RiC-CM corresponding component: Class implementation of RiC-R023 and RiC-023i relations

Record Resource Holding Relation
type: Class
equivalent class: Restriction
  on property: has the role of the Record Resource Holding Relation
  has self: true
subclass of: Management Relation
subclass of: Restriction
  on property: relation has source
  min qualified cardinality: 1
  on class: Agent
subclass of: Restriction
  on property: relation has target
  min qualified cardinality: 1
  on class: Class
    union of: Instantiation
    union of: Record Resource
comment: Connects at least one Agent and one or more Record Resource or Instantiation that the Agent(s) hold(s) or held. The Agent(s) is the source of the Relation and the Record Resource(s) or Instantiation is the target.
label: Akteur-Aufbewahrung-Recordressource/Instanz @de
label: Relación entre agentes y recursos documentales que conservan @es
label: Relation entre agents et ressources archivistiques ou instanciations conservées @fr
change note: Added a new rdfs:label in German.
  date: 2025-04-08
change note: Fixed a typo in the French label.
  date: 2023-12-30
change note: Improved the description of the Relation class (rdfs:comment) by clearly specifying how it is directed.
  date: 2023-12-06
change note: Aligned with RiC-CM 1.0: updated the description (rdfs:comment).
  date: 2023-11-12
change note: In order to get a system of rolified Relation classes: added an equivalentClass object property; replaced the specific object properties by the generic ones in the subClassOf declarations.
  date: 2023-11-08
change note: Added a new rdfs:label in Spanish.
  date: 2023-11-02
change note: Added a new rdfs:label in French.
  date: 2023-08-25
RiC-CM corresponding component: Class implementation of RiC-R039 and RiC-039i relations

Record Resource to Instantiation Relation
type: Class
equivalent class: Restriction
  on property: has the role of the Record Resource to Instantiation Relation
  has self: true
subclass of: Relation
subclass of: Restriction
  on property: relation has source
  qualified cardinality: 1
  on class: Record Resource
subclass of: Restriction
  on property: relation has target
  min qualified cardinality: 1
  on class: Instantiation
comment: Connects a Record Resource to one or more Instantiations that instantiate it, and which either may exist or may have been lost or destroyed. The Record Resource is the source of the Relation and the Instantiation(s) is the target.
label: Recordressource-Repräsentation @de
label: Relación de recurso documental a instanciación @es
label: Relation d’instanciation @fr
change note: Added a new rdfs:label in German.
  date: 2025-04-08
change note: Improved the description of the Relation class (rdfs:comment) by clearly specifying how it is directed.
  date: 2023-12-06
change note: Aligned with RiC-CM 1.0: updated the description (rdfs:comment), skos:scopeNote.
  date: 2023-11-12
change note: In order to get a system of rolified Relation classes: added an equivalentClass object property; replaced the specific object properties by the generic ones in the subClassOf declarations.
  date: 2023-11-08
change note: Added a new rdfs:label in Spanish.
  date: 2023-11-02
change note: Added a new rdfs:label in French.
  date: 2023-08-25
scope note: In some situations, it may be useful or necessary to connect a record resource to an instantiation that no longer exists or has been lost, when some of its characteristics are known from a source, such as an old finding aid.
RiC-CM corresponding component: Class implementation of RiC-R025 and RiC-R025i relations

Record Resource to Record Resource Relation
type: Class
equivalent class: Restriction
  on property: has the role of the Record Resource to Record Resource Relation
  has self: true
subclass of: Relation
subclass of: Restriction
  on property: relation connects
  min qualified cardinality: 2
  on class: Record Resource
comment: Connects at least two Record Resources. This Relation is a generic, not oriented one.
label: Recordressource-Recordressource @de
label: Relación entre recursos documentales @es
label: Relation entre ressources archivistiques @fr
change note: Added a new rdfs:label in German.
  date: 2025-04-08
change note: Improved the description of the Relation class (rdfs:comment) by clearly specifying how it is directed.
  date: 2023-12-06
change note: Aligned with RiC-CM 1.0: updated the skos:scopeNote.
  date: 2023-11-12
change note: In order to get a system of rolified Relation classes: added an equivalentClass object property; replaced the specific object properties by the generic ones in the subClassOf declarations.
  date: 2023-11-08
change note: Added a new rdfs:label in Spanish.
  date: 2023-11-02
change note: Added a new rdfs:label in French.
  date: 2023-08-25
scope note: Use to connect two record resources only if it is not possible to use a narrower, more specific relation, for example RecordResourceGeneticRelation.
RiC-CM corresponding component: Class implementation of RiC-R022 and RiC-022i relations

Record Set
type: Class
subclass of: Record Resource
comment: One or more records that are grouped together by an Agent based on the records sharing one or more attributes or relations.
label: Agrupación documental @es
label: Ensemble d’objets informationnels @fr
label: Recordgruppe @de
change note: Added a new rdfs:label in German.
  date: 2025-04-08
change note: Aligned with RiC-CM 1.0: updated the description (rdfs:comment), skos:scopeNote.
  date: 2023-11-12
change note: Added a new rdfs:label in Spanish.
  date: 2023-11-02
change note: Added a new rdfs:label in French.
  date: 2023-08-25
change note: Removed the 0.2 existing unnecessary restriction.
  date: 2023-04-19
change note: comment: updated. Scope note: updated and made several paragraphs. Objective: to make RiC-O compliant with RiC-CM v0.2.
  date: 2020-10-23
scope note: Record set is a kind of Record Resource. The member records in a Record Set may physically reside together, though physical proximity is not essential. In a particular context, an Agent (for example, administrator, records manager, archivist, end-user, etc.) may select the member records of a Record Set based on any shared attribute or attributes, or any shared relation or relations. The grouping of the records serves a purpose or purposes specific to the context of the Agent. For example, all member records of a Record Set have been accumulated by the same Agent; have the same Documentary Form Type; or are related to and document the same Activity. A Record Set may represent the act of classifying the records in accordance with a formal classification scheme that may be based on activity, subject, organizational structure, or other criteria; an act of archival arrangement (for example, based on common provenance); or some other selection and grouping that fulfils a particular purpose or purposes (for example, a classification that reflects or supports the purposes of a researcher). By exception, some records are brought together based on their not belonging in the context of selection to other designated groups: a 'Miscellaneous' series, for example. A Record Sset accumulated by an Agent in the course of life or work activity should be described in a manner that preserves context and evidential value. Record Sets may also contain other Record Sets. A Record Set or Record may simultaneously be a member of more than one Record Set, and over the course of its existence, a Record Set or Record may be a member of an indeterminate number of Record Sets in an indeterminate number of contexts. Record Sets and Records contained within a Record Set may be ordered into a sequence based on a common property or relation, or common properties or relations (for example, alphabetical by agent or related place); chronological order by creation date; or some other criterion (for exa…
RiC-CM corresponding component: Corresponds to RiC-E03 (Record Set entity)

Record Set Type
type: Class
subclass of: Type
comment: A broad categorization of the type of Record Set.
label: Recordgruppenkategorie @de
label: Tipo de agrupación documental @es
label: Type d’ensemble d’objets informationnels @fr
change note: Added a new rdfs:label in German.
  date: 2025-04-08
change note: Aligned with RiC-CM 1.0: updated the skos:scopeNote.
  date: 2023-11-12
change note: Added a new rdfs:label in Spanish.
  date: 2023-11-02
change note: Added a new rdfs:label in French.
  date: 2023-08-25
change note: Removed the 0.2 existing unnecessary restriction.
  date: 2023-04-19
change note: scope note: updated. Objective: to make RiC-O compliant with RiC-CM v0.2.
  date: 2020-10-23
scope note: Four instances of Record Set Type are included for now in RiC-O; they also are instances of skos:Concept and, as such, part of a SKOS vocabulary. Record Set Type may also be used (or extended) to categorize types of Record Set that have not traditionally been considered archival, e.g. search result list.
RiC-CM corresponding component: Corresponds to RiC-A36 (Record Set Type attribute)

Record State
type: Class
subclass of: Type
comment: Description of the production or reproduction status of a Record or Record Part.
label: Estado de documento @es
label: État d’un objet informationnel @fr
label: Recordstatus @de
change note: Added a new rdfs:label in German.
  date: 2025-04-08
change note: Aligned with RiC-CM 1.0: updated the description (rdfs:comment), skos:scopeNote.
  date: 2023-11-12
change note: Added a new rdfs:label in Spanish.
  date: 2023-11-02
change note: Added a new rdfs:label in French.
  date: 2023-08-25
change note: IRI and label changed (RecordResourceState to RecordState), as well as textual definition.
  date: 2020-12-28
change note: scope note: updated. Objective: to make RiC-O compliant with RiC-CM v0.2.
  date: 2020-10-23
scope note: Can refer both to a record's stage of creation (for example "draft") and its form of transmission when the record was received (for example "copy").
RiC-CM corresponding component: Corresponds to RiC-A39 (State attribute)

Relation
type: Class
equivalent class: Restriction
  on property: has the role of the Relation
  has self: true
subclass of: Thing
comment: The top level relation class. It connects at least two Things. An instance of a Relation may have some datatype and object properties: a general description (datatype property) like any Thing; a certainty (for 'certain', 'quite probable', 'uncertain','unknown'); a date (use either the date datatype property or the Date class and isAssociatedWithDate object property); a state (relationState); a location (use the Place class and isAssociatedWithPlace object property); a source of information that can be used as an evidence for it (use either source datatype property or hasSource object property). This Relation is the most generic one; it is not oriented.
label: Beziehung @de
label: Relación @es
change note: Added a new rdfs:label in German.
  date: 2025-04-08
change note: Improved the description of the Relation class (rdfs:comment) by clearly specifying how it is directed.
  date: 2023-12-06
change note: Aligned with RiC-CM 1.0: updated the description (rdfs:comment).
  date: 2023-11-12
change note: added the equivalence to relation_role.
  date: 2023-11-08
change note: Added a new rdfs:label in Spanish.
  date: 2023-11-02
change note: Added a new rdfs:label in French.
  date: 2023-08-25
change note: Removed the restrictions; completed the definition and scope note.
  date: 2021-02-08
scope note: Use when direct, binary object properties are not enough, e.g. when you need to record a date, a location or any other descriptive element for a relation (till RDF-Star becomes a W3C recommendation and provides a lighter method for doing so); or when the relation invloves more than two entities (n-ary relation). It is recommended to use the subclasses of the Relation class.

Representation Type
type: Class
subclass of: Type
comment: Method of recording the content type of an Instantiation
label: Repräsentationskategorie @de
label: Tipo de grabación @es
label: Type de représentation @fr
change note: Added a new rdfs:label in German.
  date: 2025-04-08
change note: Aligned with RiC-CM 1.0: updated the description (rdfs:comment), skos:scopeNote.
  date: 2023-11-12
change note: Added a new rdfs:label in Spanish.
  date: 2023-11-02
change note: Added a new rdfs:label in French.
  date: 2023-08-25
change note: Removed the 0.2 existing unnecessary restriction.
  date: 2023-04-19
change note: Comment and scope note: updated. Objective: to make RiC-O compliant with RiC-CM v0.2.
  date: 2020-10-23
scope note: Can be unmediated (which allows humans to receive the message communicated without an intermediation of a device) and mediated (which needs a device to decode the message). A lot of contemporary mediated types are digital. Each representation type may present specific features: bit rate for audio, resolution for digital images, encoding format for video etc. Depending on the type, specific attributes may be added to describe their characteristics.
RiC-CM corresponding component: Corresponds to RiC-A37 (Representation Type attribute)

Role Type
type: Class
subclass of: Type
comment: The role an Agent plays in some context (usually in some creation relation). Not to be confused with a Position (position of an agent in some group). For example, a Person who is the head of some Corporate Body may play the role of annotator (of a record) in a creation relation.
label: Rollenkategorie @de
label: Tipo de rol @es
label: Type de rôle @fr
change note: Added a new rdfs:label in German.
  date: 2025-04-08
change note: Added a new rdfs:label in Spanish.
  date: 2023-11-02
change note: Added a new rdfs:label in French.
  date: 2023-08-25

Rule
type: Class
subclass of: Thing
comment: Conditions that govern the existence, responsibility, or authority of an Agent; or the performance of an Activity by an Agent; or that contribute to the distinct characteristics of things created or managed by an Agent.
label: Regel @de
label: Regla @es
label: Règle @fr
change note: Added a new rdfs:label in German.
  date: 2025-04-08
change note: Aligned with RiC-CM 1.0: updated the description (rdfs:comment), skos:scopeNote.
  date: 2023-11-12
change note: Added a new rdfs:label in Spanish.
  date: 2023-11-02
change note: Added a new rdfs:label in French.
  date: 2023-08-25
change note: Removed the 0.2 existing unnecessary restriction.
  date: 2023-04-19
change note: Updated the definition (rdfs:comment) and scope note, as they were recently changed in RiC-CM 0.2 full draft.
  date: 2021-02-11
change note: Scope note: made separate paragraphs and updated. Objective: to make RiC-O compliant with RiC-CM v0.2.
  date: 2020-10-23
scope note: Rule is a kind of Thing. Rule can be related directly to agent, activity, or anything created or managed by agents, such as a record resource or instantiation. A rule may be unwritten or written or otherwise documented. Unwritten rules may include though are not limited to the following: social mores, customs, or community expectations. Written rules may include though are not limited to the following: constitutions, legislation, acts (legal), statutes, legal codes, ordinances, charters, mission statements, regulations, policies, procedures, instructions, codes of conduct or ethics, professional standards, work assignments, or work plans. The source or sources of some rules governing the existence or activity of an agent may be external (for example, expressed in elections, social mores, customs, community expectations, laws, regulations, standards, and best practice codes), while others may be expressed within the immediate context of an agent (for example, policies, or written or verbal instructions). The evidence for identifying rules may be found in their entirety in one documentary source (for example, a law or regulation) or may be found in two or more sources. Rule should not be confused with the one or more documentary sources that serve as evidence of its identity. A documentary source is a record.
RiC-CM corresponding component: Corresponds to RiC-E16 (Rule entity)

Rule Relation
type: Class
equivalent class: Restriction
  on property: has the role of the Rule Relation
  has self: true
subclass of: Relation
subclass of: Restriction
  on property: relation has source
  min qualified cardinality: 1
  on class: Rule
subclass of: Restriction
  on property: relation has target
  min qualified cardinality: 1
  on class: Thing
comment: Connects at least one Rule to at least one Thing when it is associated with existence and lifecycle of the Thing. The Rule(s) is the source of the Relation, and the Thing(s) is the target.
label: Regel-Ding @de
label: Relación con regla @es
label: Relation impliquant une règle @fr
change note: Added a new rdfs:label in German.
  date: 2025-04-08
change note: Improved the description of the Relation class (rdfs:comment) by clearly specifying how it is directed.
  date: 2023-12-06
change note: In order to get a system of rolified Relation classes: added an equivalentClass object property; replaced the specific object properties by the generic ones in the subClassOf declarations.
  date: 2023-11-08
change note: Added a new rdfs:label in Spanish.
  date: 2023-11-02
change note: Added a new rdfs:label in French.
  date: 2023-08-25
RiC-CM corresponding component: Class implementation of RiC-R062 and RiC-R062i relations

Rule Type
type: Class
subclass of: Type
comment: Categorization of a Rule.
label: Regelkategorie @de
label: Tipo de regla @es
label: Type de règle @fr
change note: Added a new rdfs:label in German.
  date: 2025-04-08
change note: Aligned with RiC-CM 1.0: added a rico:RiCCMCorrespondingComponent.
  date: 2023-11-12
change note: Added a new rdfs:label in Spanish.
  date: 2023-11-02
change note: Added a new rdfs:label in French.
  date: 2023-08-25
change note: Removed the 0.2 existing unnecessary restriction.
  date: 2023-04-19
change note: Class added along with hasRuleType and isRuleTypeOf object properties.
  date: 2020-10-19
scope note: For example, for rules that can be applied to record resources : access rule, use rule, etc.
RiC-CM corresponding component: Corresponds to RiC-A45 (Rule Type attribute).

Sequential Relation
type: Class
equivalent class: Restriction
  on property: has the role of the Sequential Relation
  has self: true
subclass of: Relation
subclass of: Restriction
  on property: relation has source
  min qualified cardinality: 1
  on class: Thing
subclass of: Restriction
  on property: relation has target
  min qualified cardinality: 1
  on class: Thing
comment: Connects at least one Thing to at least one other Thing that follows or followed it in some sequence. The Relation is oriented from the first Thing(s) in the sequence to the following one(s): the first Thing(s) is the source, and the following Thing(s) is the target.
label: Ding-Abfolge-Ding @de
label: Relación secuencial @es
label: Relation séquentielle @fr
change note: Added a new rdfs:label in German.
  date: 2025-04-08
change note: Improved the description of the Relation class (rdfs:comment) by clearly specifying how it is directed.
  date: 2023-12-06
change note: Aligned with RiC-CM 1.0: updated the description (rdfs:comment), skos:scopeNote.
  date: 2023-11-12
change note: In order to get a system of rolified Relation classes: added an equivalentClass object property; replaced the specific object properties by the generic ones in the subClassOf declarations.
  date: 2023-11-08
change note: Added a new rdfs:label in Spanish.
  date: 2023-11-02
change note: Added a new rdfs:label in French.
  date: 2023-08-25
scope note: The relation does not specify the criteria used for ordering the sequence. There may be zero to many intermediate entities, ignored or unknown, in the sequence between the two connected things. Can be used, for example, for specifying that a record "has next" another record within a record set.
RiC-CM corresponding component: Class implementation of RiC-R008 and RiC-R008i relations

Sibling Relation
type: Class
equivalent class: Restriction
  on property: has the role of the Sibling Relation
  has self: true
subclass of: Family Relation
subclass of: Restriction
  on property: relation connects
  min qualified cardinality: 2
  on class: Person
comment: Connects at least two Persons, when they are siblings. This Relation is not oriented.
label: Person-Geschwister @de
label: Relación familiar entre hermanos @es
label: Relation de fratrie @fr
change note: Added a new rdfs:label in German.
  date: 2025-04-08
change note: Improved the description of the Relation class (rdfs:comment) by clearly specifying how it is directed.
  date: 2023-12-06
change note: In order to get a system of rolified Relation classes: added an equivalentClass object property; replaced the specific object properties by the generic ones in the subClassOf declarations.
  date: 2023-11-08
change note: Added a new rdfs:label in Spanish.
  date: 2023-11-02
change note: Added a new rdfs:label in French.
  date: 2023-08-25
RiC-CM corresponding component: Class implementation of RiC-R048 and RiC-R048i relations

Spouse Relation
type: Class
equivalent class: Restriction
  on property: has the role of the Spouse Relation
  has self: true
subclass of: Family Relation
subclass of: Restriction
  on property: relation connects
  min qualified cardinality: 2
  on class: Person
comment: Connects at least two Persons, when they are spouses. This Relation is not oriented.
label: Person-Ehepartner @de
label: Relación matrimonial entre personas @es
label: Relation matrimoniale @fr
change note: Added a new rdfs:label in German.
  date: 2025-04-08
change note: Improved the description of the Relation class (rdfs:comment) by clearly specifying how it is directed.
  date: 2023-12-06
change note: In order to get a system of rolified Relation classes: added an equivalentClass object property; replaced the specific object properties by the generic ones in the subClassOf declarations.
  date: 2023-11-08
change note: Added a new rdfs:label in Spanish.
  date: 2023-11-02
change note: Added a new rdfs:label in French.
  date: 2023-08-25
RiC-CM corresponding component: Class implementation of RiC-R049 and RiC-R049i relations

Study At Relation
type: Class
equivalent class: Restriction
  on property: has the role of the Study At Relation
  has self: true
subclass of: Membership Relation
subclass of: Restriction
  on property: relation has source
  qualified cardinality: 1
  on class: Group
subclass of: Restriction
  on property: relation has target
  min qualified cardinality: 1
  on class: Person
comment: Connects a Group (as an educational institution) to at least one Person who studied or study at this group. Both 'institution' and 'at' can be interpreted broadly. The Relation is oriented from the educational institution to the student(s): the former is the source of the Relation, and the latter is/are the target.
label: Relación entre institución educativa y estudiantes @es
label: Relation entre institution d’enseignement et étudiants @fr
label: Studium-An-Beziehung @de
change note: Added a new rdfs:label in German.
  date: 2025-04-08
change note: Fixed details in the definition. Added the French and Spanish labels.
  date: 2024-12-23
change note: Added in RiC-O 1.1.
  date: 2024-12-19

Teaching Relation
type: Class
equivalent class: Restriction
  on property: has the role of the Teaching Relation
  has self: true
subclass of: Knowing Relation
subclass of: Restriction
  on property: relation has source
  min qualified cardinality: 1
  on class: Person
subclass of: Restriction
  on property: relation has target
  min qualified cardinality: 1
  on class: Person
comment: Connects at least one Person to at least another Person who is or was their student. The Relation is oriented from the teacher(s) to the student(s): the teacher Person(s) is the source of the Relation, and the student Person(s) is the target.
label: Person-Student @de
label: Relación académica entre profesor y alumno @es
label: Relation entre enseignants et étudiants @fr
change note: Added a new rdfs:label in German.
  date: 2025-04-08
change note: Improved the description of the Relation class (rdfs:comment) by clearly specifying how it is directed.
  date: 2023-12-06
change note: Aligned with RiC-CM 1.0: updated the description (rdfs:comment).
  date: 2023-11-12
change note: In order to get a system of rolified Relation classes: added an equivalentClass object property; replaced the specific object properties by the generic ones in the subClassOf declarations.
  date: 2023-11-08
change note: Added a new rdfs:label in Spanish.
  date: 2023-11-02
change note: Added a new rdfs:label in French.
  date: 2023-08-25
RiC-CM corresponding component: Class implementation of RiC-R053 and RiC-R053i relations

Temporal Relation
type: Class
equivalent class: Restriction
  on property: has the role of the Temporal Relation
  has self: true
subclass of: Sequential Relation
subclass of: Restriction
  on property: relation has source
  min qualified cardinality: 1
  on class: Thing
subclass of: Restriction
  on property: relation has target
  min qualified cardinality: 1
  on class: Thing
comment: Connects at least one Thing to at least one other Thing that follows it in chronological order. The Relation is oriented chronologically: the preceding Thing(s) is the source of the Relation, the following Thing(s) is the target.
label: Ding-Zeitfolge-Ding @de
label: Relación temporal @es
label: Relation temporelle @fr
change note: Added a new rdfs:label in German.
  date: 2025-04-08
change note: Improved the description of the Relation class (rdfs:comment) by clearly specifying how it is directed.
  date: 2023-12-06
change note: Aligned with RiC-CM 1.0: updated the skos:scopeNote.
  date: 2023-11-12
change note: In order to get a system of rolified Relation classes: added an equivalentClass object property; replaced the specific object properties by the generic ones in the subClassOf declarations.
  date: 2023-11-08
change note: Added a new rdfs:label in Spanish.
  date: 2023-11-02
change note: Added a new rdfs:label in French.
  date: 2023-08-25
scope note: There may be zero to many intermediate entities, ignored or unknown, in the chronological sequence between the connected entities.
RiC-CM corresponding component: Class implementation of RiC-R009 and RiC-R009i relations

Thing
type: Class
comment: Any idea, material thing, or event within the realm of human experience.
label: Chose @fr
label: Cosa @es
label: Ding @de
change note: Added a new rdfs:label in German.
  date: 2025-04-08
change note: Added a new rdfs:label in Spanish.
  date: 2023-11-02
change note: Added a new rdfs:label in French.
  date: 2023-08-25
change note: made separate paragraphs in the scope note.
  date: 2020-10-23
scope note: Includes all RiC entities as well as any concept, material thing, or event that may be the subject of a Record Resource or associated with an Activity. Examples of entities not explicitly addressed in RiC includes but is not limited to the following: abstract concepts; cultural movements, named periods and events; named things, objects and works; legendary, mythical or fictitious figures, characters or beings.
RiC-CM corresponding component: Corresponds to RiC-E01 (Thing entity)

Title
type: Class
subclass of: Name
comment: A name that is used for a Record Resource or a Rule
label: Intitulé @fr
label: Titel @de
label: Título @es
change note: Added a new rdfs:label in German.
  date: 2025-04-08
change note: Added a new rdfs:label in Spanish.
  date: 2023-11-02
change note: Added a new rdfs:label in French.
  date: 2023-08-25
RiC-CM corresponding component: Class implementation of a specialization of RiC-A28 (Name attribute)

Title Type
type: Class
subclass of: Type
comment: Categorization of a Title.
label: Tipo de título @es
label: Titelkategorie @de
label: Type de titre @fr
change note: Added a new rdfs:label in German.
  date: 2025-04-08
change note: Class added along with hasTitleType and isTitleTypeOf object properties.
  date: 2024-10-04
scope note: For example, 'obsolete title' ; 'title on the original' ; 'anonimised title'

Type
type: Class
subclass of: Concept
comment: A superclass for any type of some thing. A type characterizes an entity.
label: Kategorie @de
label: Tipo @es
change note: Added a new rdfs:label in German.
  date: 2025-04-08
change note: Updated the rdfs:comment (replaced the word 'category' with 'type').
  date: 2024-10-10
change note: Added a new rdfs:label in Spanish.
  date: 2023-11-02
change note: Added a new rdfs:label in French.
  date: 2023-08-25

Type Relation
type: Class
equivalent class: Restriction
  on property: has the role of the Type Relation
  has self: true
subclass of: Relation
subclass of: Restriction
  on property: relation has source
  qualified cardinality: 1
  on class: Type
subclass of: Restriction
  on property: relation has target
  min qualified cardinality: 1
  on class: Thing
comment: Connects a category (a Type) and at least one Thing that belongs to this category. The Type(s) is the source of the Relation, and the Thing(s) is the target.
label: Kategorie-Ding @de
label: Relation de catégorisation @fr
label: Tipo de relación @es
change note: Added a new rdfs:label in German.
  date: 2025-04-08
change note: Improved the description of the Relation class (rdfs:comment) by clearly specifying how it is directed.
  date: 2023-12-06
change note: In order to get a system of rolified Relation classes: added an equivalentClass object property; replaced the specific object properties by the generic ones in the subClassOf declarations.
  date: 2023-11-08
change note: Added a new rdfs:label in Spanish.
  date: 2023-11-02
change note: Added a new rdfs:label in French.
  date: 2023-08-25
scope note: May be useful at least for some types (e.g. demographic group)

Unit Of Measurement
type: Class
subclass of: Concept
comment: A definite magnitude of a quantity, defined and adopted by convention or by law, that is used as a standard for measurement of the same kind of quantity. Can be spacial units (cm, m), weight (g, kg), time (s, h), storage (MB, TB) or more informal units used in the archival context like number of boxes, pages or words.
label: Masseinheit @de
label: Unidad de medida @es
label: Unité de mesure @fr
change note: Added a new rdfs:label in German.
  date: 2025-04-08
change note: Added a new rdfs:label in Spanish.
  date: 2023-11-02
change note: Added an xml:lang attribute to the rdfs:comment.
  date: 2023-08-28
change note: Added a new rdfs:label in French.
  date: 2023-08-25
change note: Class added in order to be able to handle units of measurement as full entities.
  date: 2020-10-28

Whole Part Relation
type: Class
equivalent class: Restriction
  on property: has the role of the Whole Part Relation
  has self: true
subclass of: Relation
subclass of: Restriction
  on property: relation has source
  qualified cardinality: 1
  on class: Thing
subclass of: Restriction
  on property: relation has target
  min qualified cardinality: 1
  on class: Thing
comment: Connects a Thing to at least one other Thing that is or was a portion or division of the whole Thing. The Relation is oriented from the Thing to its part(s): the Thing is the source of the Relation, and the part Thing(s) is the target.
label: Relación entre todo y parte @es
label: Relation partitive @fr
label: Teil-Ganzes-Beziehung @de
change note: Added a new rdfs:label in German.
  date: 2025-04-08
change note: Improved the description of the Relation class (rdfs:comment) by clearly specifying how it is directed.
  date: 2023-12-06
change note: Aligned with RiC-CM 1.0: updated the description (rdfs:comment).
  date: 2023-11-12
change note: In order to get a system of rolified Relation classes: added an equivalentClass object property; replaced the specific object properties by the generic ones in the subClassOf declarations.
  date: 2023-11-08
change note: Added a new rdfs:label in Spanish.
  date: 2023-11-02
change note: Added a new rdfs:label in French.
  date: 2023-08-25
RiC-CM corresponding component: Class implementation of RiC-R002 and RiC-R002i relations

Work Relation
type: Class
equivalent class: Restriction
  on property: has the role of the Work Relation
  has self: true
subclass of: Agent Relation
subclass of: Restriction
  on property: relation connects
  min qualified cardinality: 2
  on class: Agent
comment: Connects at least two Agents that have or had some type of work relation in the course of their activities. This Relation is not oriented.
label: Akteur-Arbeit-Akteur @de
label: Relación profesional @es
label: Relation de travail @fr
change note: Added a new rdfs:label in German.
  date: 2025-04-08
change note: Improved the description of the Relation class (rdfs:comment) by clearly specifying how it is directed.
  date: 2023-12-06
change note: Aligned with RiC-CM 1.0: updated the description (rdfs:comment).
  date: 2023-11-12
change note: In order to get a system of rolified Relation classes: added an equivalentClass object property; replaced the specific object properties by the generic ones in the subClassOf declarations.
  date: 2023-11-08
change note: Added a new rdfs:label in Spanish.
  date: 2023-11-02
change note: Added a new rdfs:label in French.
  date: 2023-08-25
RiC-CM corresponding component: Class implementation of RiC-R046 and RiR046i relations

International Council on Archives Records in Contexts Vocabulary for Documentary Form Types
type: NamedIndividual
type: ConceptScheme
has top concept: authority record
has top concept: finding aid
creator: International Coucil on Archives Expert Group on Archival Description (ICA EGAD)
language: en
language: es
language: fr
version: 1.1
label: Documentary Form Types
label: Tipos documentales @es
label: Types de documents @fr
change note: Added a dcat:version property.
  date: 2025-05-14
change note: Added the IIIF manifest documentary form type, with broader concept finding aid. Updated the scope note of the vocabulary.
  date: 2025-01-30
change note: Completed the metadata of the vocabulary: added dc:language, a history note and a scope note.
  date: 2023-12-13
change note: Added a new rdfs:label in Spanish.
  date: 2023-11-25
change note: Added a new rdfs:label in French.
  date: 2023-08-28
definition: A vocabulary that provides URIs for describing documentary form types of RiC Records and Record Parts.
scope note: For now this vocabulary only defines three concepts; it should hopefully be completed later. The concepts defined in this vocabulary can be used in combination with RiC-O classes and properties, whenever necessary and appropriate, to assign a documentary form type to a Record or a Record Part, using the rico:hasDocumentaryFormType object property, or its inverse one. They also can be used to specify that a rico:RecordSet included or includes members whose some (rico:hasOrHadSomeMembersWithDocumentaryFormType) or all (rico:hasOrHadAllMembersWithDocumentaryFormType) have some Documentary Form Type. Each concept is both defined as a skos:Concept and a rico:DocumentaryFormType, so that it is possible to extend the classic definition of such concepts using RiC-O properties. For example, you can use rico:history, rico:date, or rico:isAssociatedWithPlace, rico:precedesInTime, if you consider a documentary form type as being a historical entity, known and used in some known space or time region.

authority record
type: NamedIndividual
type: Concept
type: Documentary Form Type
in scheme: International Council on Archives Records in Contexts Vocabulary for Documentary Form Types
top concept of: International Council on Archives Records in Contexts Vocabulary for Documentary Form Types
label: notice d’autorité @fr
label: registro de autoridad @es
change note: Added a new rdfs:label in Spanish.
  date: 2023-11-25
change note: Added a new rdfs:label in French.
  date: 2023-08-28
definition: This category can be used for records that describe an entity.

finding aid
type: NamedIndividual
type: Concept
type: Documentary Form Type
in scheme: International Council on Archives Records in Contexts Vocabulary for Documentary Form Types
top concept of: International Council on Archives Records in Contexts Vocabulary for Documentary Form Types
narrower: IIIF manifest
label: instrument de recherche @fr
label: instrumento de descripción @es
change note: Added a skos:narrower with object the IIIF Manifest concept.
  date: 2025-01-30
change note: Added a new rdfs:label in Spanish.
  date: 2023-11-25
change note: Added a new rdfs:label in French.
  date: 2023-08-28
definition: This documentary form type can be used for records that aggregate and organizes metadata on some record(s) or record set(s).

IIIF manifest
type: NamedIndividual
type: Concept
type: Documentary Form Type
in scheme: International Council on Archives Records in Contexts Vocabulary for Documentary Form Types
broader: finding aid
label: manifeste IIIF @fr
change note: Added to RiC-O 1.1.
  date: 2025-01-30
definition: Can be used to categorize records which describe collections of cultural heritage objects, or of a single cultural object, and whose instantiations are compliant to the IIIF Presentation API.

International Council on Archives Records in Contexts Vocabulary for Record Set Types
type: NamedIndividual
type: ConceptScheme
has top concept: collection
has top concept: file
has top concept: fonds
has top concept: series
creator: International Coucil on Archives Expert Group on Archival Description (ICA EGAD)
language: en
language: es
language: fr
version: 1.1
label: Record Set Types
label: Tipos de agrupación documental @es
label: Types d’ensembles d’objets informationnels @fr
change note: Added a dcat:version property.
  date: 2025-05-14
change note: Completed the metadata of the vocabulary: added dc:language, a history note and a scope note.
  date: 2023-12-13
change note: Added a new rdfs:label in Spanish.
  date: 2023-11-25
change note: Added a new rdfs:label in French.
  date: 2023-08-28
definition: A vocabulary that provides URIs for describing types of RiC Record Sets.
scope note: For now this vocabulary only defines four top concepts; it should hopefully be completed later. The concepts defined in this vocabulary can be used in combination with RiC-O classes and properties, whenever necessary and appropriate, to assign a record set type to a Record Set, using the rico:hasRecordSetType object property, or its inverse one. Each concept is both defined as a skos:Concept and a rico:RecordSetType, so that it is possible to extend the classic definition of such concepts using RiC-O properties. For example, you can use rico:history, rico:date, or rico:isAssociatedWithPlace, rico:precedesInTime, if you consider a record set type as being a historical entity, known and used in some known space or time region.

collection
type: NamedIndividual
type: Concept
type: Record Set Type
in scheme: International Council on Archives Records in Contexts Vocabulary for Record Set Types
top concept of: International Council on Archives Records in Contexts Vocabulary for Record Set Types
label: colección @es
change note: Added a new rdfs:label in Spanish.
  date: 2023-11-25
change note: Added a new rdfs:label in French.
  date: 2023-08-28
definition: An artificial assemblage of documents accumulated on the basis of some common characteristic without regard to the provenance of those documents. Not to be confused with an archival fonds. (From ICA ISAD(G))

file
type: NamedIndividual
type: Concept
type: Record Set Type
in scheme: International Council on Archives Records in Contexts Vocabulary for Record Set Types
top concept of: International Council on Archives Records in Contexts Vocabulary for Record Set Types
label: dossier @fr
label: expediente @es
change note: Added a new rdfs:label in Spanish.
  date: 2023-11-25
change note: Added a new rdfs:label in French.
  date: 2023-08-28
definition: An organized unit of documents grouped together either for current use by the creator or in the process of archival arrangement, because they relate to the same subject, activity, or transaction. A file is usually the basic unit within a record series. (From ICA ISAD(G))

fonds
type: NamedIndividual
type: Concept
type: Record Set Type
in scheme: International Council on Archives Records in Contexts Vocabulary for Record Set Types
top concept of: International Council on Archives Records in Contexts Vocabulary for Record Set Types
label: fondo @es
change note: Added a new rdfs:label in Spanish.
  date: 2023-11-25
change note: Added a new rdfs:label in French.
  date: 2023-08-28
definition: The whole of the records, regardless of form or medium, organically created and/or accumulated and used by a particular person, family, or corporate body in the course of that creator's activities and functions. (From ICA ISAD(G))

series
type: NamedIndividual
type: Concept
type: Record Set Type
in scheme: International Council on Archives Records in Contexts Vocabulary for Record Set Types
top concept of: International Council on Archives Records in Contexts Vocabulary for Record Set Types
label: serie @es
label: série organique @fr
change note: Added a new rdfs:label in Spanish.
  date: 2023-11-25
change note: Added a new rdfs:label in French.
  date: 2023-08-28
definition: Documents arranged in accordance with a filing system or maintained as a unit because they result from the same accumulation or filing process, or the same activity; have a particular form; or because of some other relationship arising out of their creation, receipt, or use. A series is also known as a records series. (From ICA ISAD(G))